BDBM301063 4-{3-[((3R)-3- aminopiperidyl)carbonyl]-5-(2- pyridylmethoxy)pyrazolyl} benzenecarbonitrile::US10131664, Example 56
SMILES N[C@@H]1CCCN(C1)C(=O)c1cc(OCc2ccccn2)n(n1)-c1ccc(cc1)C#N
InChI Key InChIKey=CFBCSWPEJOEMIS-QGZVFWFLSA-N
Data  4 IC50  1 Kd
  Tab Delimited (TSV)   2D SDfile   Computed 3D by Vconf -m prep SDfile
Find this compound or compounds like it in BindingDB:
Activity Spreadsheet -- Enzyme Inhibition Constant Data from BindingDB
Found 5 hits for monomerid = 301063
TargetLysine-specific histone demethylase 1A(Homo sapiens (Human))
Celgene Quanticel Research
US Patent
LigandPNGBDBM301063(4-{3-[((3R)-3- aminopiperidyl)carbonyl]-5-(2- pyri...)
Affinity DataIC50: <10nM. Assay description: The enzymatic assay of LSD1 activity is based on Time Resolved-Fluorescence Resonance Energy Transfer (TR-FRET) detection. The inhibitory properties ...
Ligand InfoPC cidPC sid
In DepthDetails US Patent
TargetLysine-specific histone demethylase 1A(Homo sapiens (Human))
Celgene Quanticel Research
US Patent
LigandPNGBDBM301063(4-{3-[((3R)-3- aminopiperidyl)carbonyl]-5-(2- pyri...)
Affinity DataIC50: <100nM. Assay description: Inhibition of full length human LSD1 expressed in Escherichia coli using H3K4me1-biotin labeled peptide as substrate after 1 hr by TR-FRET assay
Ligand InfoPC cidPC sid
In DepthDetails ArticlePubMed
TargetLysine-specific histone demethylase 1A(Homo sapiens (Human))
Celgene Quanticel Research
US Patent
LigandPNGBDBM301063(4-{3-[((3R)-3- aminopiperidyl)carbonyl]-5-(2- pyri...)
Affinity DataKd:  42nM. Assay description: Reversible inhibition of human recombinant N-terminal truncated LSD1 (151 to 852 residues) expressed in Escherichia coli by SPR analysis
Ligand InfoPC cidPC sid
In DepthDetails ArticlePubMed
TargetLysine-specific histone demethylase 1A(Homo sapiens (Human))
Celgene Quanticel Research
US Patent
LigandPNGBDBM301063(4-{3-[((3R)-3- aminopiperidyl)carbonyl]-5-(2- pyri...)
Affinity DataIC50:  230nM. Assay description: Inhibition of human recombinant N-terminal truncated LSD1 (151 to 852 residues) expressed in Escherichia coli using Histone H3(1 to 21)K4(Me1) biotin...
Ligand InfoPC cidPC sid
In DepthDetails ArticlePubMed
TargetLysine-specific histone demethylase 1A(Homo sapiens (Human))
Celgene Quanticel Research
US Patent
LigandPNGBDBM301063(4-{3-[((3R)-3- aminopiperidyl)carbonyl]-5-(2- pyri...)
Affinity DataIC50:  2.30E+3nM. Assay description: Inhibition of LSD1 in human THP1 cells assessed as upregulation of CD86 levels by ELISA
Ligand InfoPC cidPC sid
In DepthDetails ArticlePubMed