BDBM305835 (1s,3s)-3-(Cyanomethyl)-1-methyl-3-(4-(6-(1-methyl-1H-pyrazol-4-yl)pyrazolo[1,5-a]pyrazin-4-yl)-1H-pyrazol-1-yl)cyclobutane-1-carbonitrile::US10144738, Example 34::US10822341, Example 34::US11472809, Example 34
SMILES Cn1cc(cn1)-c1cn2nccc2c(n1)-c1cnn(c1)[C@@]1(CC#N)C[C@](C)(C1)C#N
InChI Key InChIKey=CZKHQVFUAHAEDE-OYRHEFFESA-N
Data  16 IC50
  Tab Delimited (TSV)   2D SDfile   Computed 3D by Vconf -m prep SDfile
Find this compound or compounds like it in BindingDB:
Activity Spreadsheet -- Enzyme Inhibition Constant Data from BindingDB
Found 16 hits for monomerid = 305835
TargetNon-receptor tyrosine-protein kinase TYK2(Homo sapiens (Human))
Pfizer
US Patent
LigandPNGBDBM305835((1s,3s)-3-(Cyanomethyl)-1-methyl-3-(4-(6-(1-methyl...)
Affinity DataIC50:  11nM. Assay description: Compounds were added to a 384-well plate. Reaction mixtures contained 10 mM HEPES, pH 7.4, 10 mM MgCl2, 0.01% BSA, 0.0005% Tween 20, 1 mM ATP and 1 &...
Ligand InfoPC cidPC sid
In DepthDetails US Patent
TargetTyrosine-protein kinase JAK3(Homo sapiens (Human))
Pfizer
US Patent
LigandPNGBDBM305835((1s,3s)-3-(Cyanomethyl)-1-methyl-3-(4-(6-(1-methyl...)
Affinity DataIC50:  3.26E+3nM. Assay description: Compounds were added to a 384-well plate. Reaction mixtures contained 10 mM HEPES, pH 7.4, 10 mM MgCl2, 0.01% BSA, 0.0005% Tween 20, 1 mM ATP and 1 &...
Ligand InfoPC cidPC sid
In DepthDetails US Patent
TargetTyrosine-protein kinase JAK2(Homo sapiens (Human))
Pfizer
US Patent
LigandPNGBDBM305835((1s,3s)-3-(Cyanomethyl)-1-methyl-3-(4-(6-(1-methyl...)
Affinity DataIC50:  19nM. Assay description: Compounds were added to a 384-well plate. Reaction mixtures contained 10 mM HEPES, pH 7.4, 10 mM MgCl2, 0.01% BSA, 0.0005% Tween 20, 1 mM ATP and 1 &...
Ligand InfoPC cidPC sid
In DepthDetails US Patent
TargetTyrosine-protein kinase JAK3(Homo sapiens (Human))
Pfizer
US Patent
LigandPNGBDBM305835((1s,3s)-3-(Cyanomethyl)-1-methyl-3-(4-(6-(1-methyl...)
Affinity DataIC50:  3.26E+3nM. Assay description: Compounds were added to a 384-well plate. Reaction mixtures contained 10 mM HEPES, pH 7.4, 10 mM MgCl2, 0.01% BSA, 0.0005% Tween 20, 1 mM ATP and 1 &...
Ligand InfoPC cidPC sid
In DepthDetails US Patent
TargetNon-receptor tyrosine-protein kinase TYK2(Homo sapiens (Human))
Pfizer
US Patent
LigandPNGBDBM305835((1s,3s)-3-(Cyanomethyl)-1-methyl-3-(4-(6-(1-methyl...)
Affinity DataIC50:  11nM. Assay description: Compounds were added to a 384-well plate. Reaction mixtures contained 10 mM HEPES, pH 7.4, 10 mM MgCl2, 0.01% BSA, 0.0005% Tween 20, 1 mM ATP and 1 &...
Ligand InfoPC cidPC sid
In DepthDetails US Patent
TargetTyrosine-protein kinase JAK1(Homo sapiens (Human))
Pfizer
US Patent
LigandPNGBDBM305835((1s,3s)-3-(Cyanomethyl)-1-methyl-3-(4-(6-(1-methyl...)
Affinity DataIC50:  96nM. Assay description: Compounds were added to a 384-well plate. Reaction mixtures contained 10 mM HEPES, pH 7.4, 10 mM MgCl2, 0.01% BSA, 0.0005% Tween 20, 1 mM ATP and 1 &...
Ligand InfoPC cidPC sid
In DepthDetails US Patent
TargetTyrosine-protein kinase JAK2(Homo sapiens (Human))
Pfizer
US Patent
LigandPNGBDBM305835((1s,3s)-3-(Cyanomethyl)-1-methyl-3-(4-(6-(1-methyl...)
Affinity DataIC50:  19nM. Assay description: Compounds were added to a 384-well plate. Reaction mixtures contained 10 mM HEPES, pH 7.4, 10 mM MgCl2, 0.01% BSA, 0.0005% Tween 20, 1 mM ATP and 1 &...
Ligand InfoPC cidPC sid
In DepthDetails US Patent
TargetTyrosine-protein kinase JAK3(Homo sapiens (Human))
Pfizer
US Patent
LigandPNGBDBM305835((1s,3s)-3-(Cyanomethyl)-1-methyl-3-(4-(6-(1-methyl...)
Affinity DataIC50:  3.26E+3nM. Assay description: Compounds were added to a 384-well plate. Reaction mixtures contained 10 mM HEPES, pH 7.4, 10 mM MgCl2, 0.01% BSA, 0.0005% Tween 20, 1 mM ATP and 1 &...
Ligand InfoPC cidPC sid
In DepthDetails US Patent
TargetNon-receptor tyrosine-protein kinase TYK2(Homo sapiens (Human))
Pfizer
US Patent
LigandPNGBDBM305835((1s,3s)-3-(Cyanomethyl)-1-methyl-3-(4-(6-(1-methyl...)
Affinity DataIC50:  11nM. Assay description: Compounds were added to a 384-well plate. Reaction mixtures contained 10 mM HEPES, pH 7.4, 10 mM MgCl2, 0.01% BSA, 0.0005% Tween 20, 1 mM ATP and 1 &...
Ligand InfoPC cidPC sid
In DepthDetails US Patent
TargetTyrosine-protein kinase JAK1(Homo sapiens (Human))
Pfizer
US Patent
LigandPNGBDBM305835((1s,3s)-3-(Cyanomethyl)-1-methyl-3-(4-(6-(1-methyl...)
Affinity DataIC50:  96nM. Assay description: Compounds were added to a 384-well plate. Reaction mixtures contained 10 mM HEPES, pH 7.4, 10 mM MgCl2, 0.01% BSA, 0.0005% Tween 20, 1 mM ATP and 1 &...
Ligand InfoPC cidPC sid
In DepthDetails US Patent
TargetTyrosine-protein kinase JAK2(Homo sapiens (Human))
Pfizer
US Patent
LigandPNGBDBM305835((1s,3s)-3-(Cyanomethyl)-1-methyl-3-(4-(6-(1-methyl...)
Affinity DataIC50:  19nM. Assay description: Compounds were added to a 384-well plate. Reaction mixtures contained 10 mM HEPES, pH 7.4, 10 mM MgCl2, 0.01% BSA, 0.0005% Tween 20, 1 mM ATP and 1 &...
Ligand InfoPC cidPC sid
In DepthDetails US Patent
TargetTyrosine-protein kinase JAK3(Homo sapiens (Human))
Pfizer
US Patent
LigandPNGBDBM305835((1s,3s)-3-(Cyanomethyl)-1-methyl-3-(4-(6-(1-methyl...)
Affinity DataIC50:  3.26E+3nM. Assay description: Compounds were added to a 384-well plate. Reaction mixtures contained 10 mM HEPES, pH 7.4, 10 mM MgCl2, 0.01% BSA, 0.0005% Tween 20, 1 mM ATP and 1 &...
Ligand InfoPC cidPC sid
In DepthDetails US Patent
TargetNon-receptor tyrosine-protein kinase TYK2(Homo sapiens (Human))
Pfizer
US Patent
LigandPNGBDBM305835((1s,3s)-3-(Cyanomethyl)-1-methyl-3-(4-(6-(1-methyl...)
Affinity DataIC50:  11nM. Assay description: Compounds were added to a 384-well plate. Reaction mixtures contained 10 mM HEPES, pH 7.4, 10 mM MgCl2, 0.01% BSA, 0.0005% Tween 20, 1 mM ATP and 1 &...
Ligand InfoPC cidPC sid
In DepthDetails US Patent
TargetTyrosine-protein kinase JAK1(Homo sapiens (Human))
Pfizer
US Patent
LigandPNGBDBM305835((1s,3s)-3-(Cyanomethyl)-1-methyl-3-(4-(6-(1-methyl...)
Affinity DataIC50:  96nM. Assay description: Compounds were added to a 384-well plate. Reaction mixtures contained 10 mM HEPES, pH 7.4, 10 mM MgCl2, 0.01% BSA, 0.0005% Tween 20, 1 mM ATP and 1 &...
Ligand InfoPC cidPC sid
In DepthDetails US Patent
TargetTyrosine-protein kinase JAK2(Homo sapiens (Human))
Pfizer
US Patent
LigandPNGBDBM305835((1s,3s)-3-(Cyanomethyl)-1-methyl-3-(4-(6-(1-methyl...)
Affinity DataIC50:  19nM. Assay description: Compounds were added to a 384-well plate. Reaction mixtures contained 10 mM HEPES, pH 7.4, 10 mM MgCl2, 0.01% BSA, 0.0005% Tween 20, 1 mM ATP and 1 &...
Ligand InfoPC cidPC sid
In DepthDetails US Patent
TargetTyrosine-protein kinase JAK1(Homo sapiens (Human))
Pfizer
US Patent
LigandPNGBDBM305835((1s,3s)-3-(Cyanomethyl)-1-methyl-3-(4-(6-(1-methyl...)
Affinity DataIC50:  96nM. Assay description: Compounds were added to a 384-well plate. Reaction mixtures contained 10 mM HEPES, pH 7.4, 10 mM MgCl2, 0.01% BSA, 0.0005% Tween 20, 1 mM ATP and 1 &...
Ligand InfoPC cidPC sid
In DepthDetails US Patent