BDBM308055 US10011593, Ex. 5::US9650366, 5
SMILES Nc1ncc(cc1-c1cc2cc(NC(=O)Nc3cc(F)cc(c3)C(F)(F)F)ccc2s1)-c1nnn(CCCO)n1
InChI Key InChIKey=ZKOKZKKIDJJUGU-UHFFFAOYSA-N
Data  1 KI  1 IC50
  Tab Delimited (TSV)   2D SDfile   Computed 3D by Vconf -m prep SDfile
Find this compound or compounds like it in BindingDB:
Activity Spreadsheet -- Enzyme Inhibition Constant Data from BindingDB
Found 2 hits for monomerid = 308055
TargetInterferon-induced, double-stranded RNA-activated protein kinase(Homo sapiens (Human))
Allergan
US Patent
LigandPNGBDBM308055(US10011593, Ex. 5 | US9650366, 5)
Affinity DataKi:  76nM. Assay description: Biochemical PDGFRβ kinase assays were performed in 96 well microtiter plates that were coated overnight with 75 μg of poly-Glu-Tyr (4:1) in...
Ligand InfoPC cidPC sid
In DepthDetails US Patent
TargetInterferon-induced, double-stranded RNA-activated protein kinase(Homo sapiens (Human))
Allergan
US Patent
LigandPNGBDBM308055(US10011593, Ex. 5 | US9650366, 5)
Affinity DataIC50:  76nM. Assay description: PKR: Commercially available recombinant human GST-PKR (SignalChem, Canada; 1.5 uM-2 uM stock) is diluted to 500 nM in assay buffer (20 mM Tris-HCl, p...
Ligand InfoPC cidPC sid
In DepthDetails US Patent