BDBM31273 Chalcone derivative, A
SMILES OC(=O)COc1ccc(\C=C\C(=O)c2ccc(Cl)cc2)cc1
InChI Key InChIKey=UFSLJQCZRHNOAH-XCVCLJGOSA-N
Data  1 IC50  1 Kd
  Tab Delimited (TSV)   2D SDfile   Computed 3D by Vconf -m prep SDfile
Find this compound or compounds like it in BindingDB:
Activity Spreadsheet -- Enzyme Inhibition Constant Data from BindingDB
Found 2 hits for monomerid = 31273
TargetE3 ubiquitin-protein ligase Mdm2(Homo sapiens (Human))
Max Planck Institute
LigandPNGBDBM31273(Chalcone derivative, A)
Affinity DataKd:  2.20E+5nMpH: 7.4 T: 2°C. Assay description: NMR measurements consisted of monitoring changes in chemical shifts and line widths of the backbone amide resonances of uniformly 15N-enriched MDM2 s...
In DepthDetails ArticlePubMed
TargetE3 ubiquitin-protein ligase Mdm2(Homo sapiens (Human))
Max Planck Institute
LigandPNGBDBM31273(Chalcone derivative, A)
Affinity DataIC50:  2.06E+5nMpH: 7.4 T: 2°C. Assay description: Interference of the p53-MDM2 binding by test compounds was measured in a 96-well polypropylene round-bottom microtiter plate (Costar, Serocluster). H...
In DepthDetails ArticlePubMed