BDBM313198 N-(8-chloro-2-oxo-1-propyl-3,4-dihydroquinolin-6-yl)-1-(4-cyclopropylphenyl)methanesulfonamide::US10167261, Compound 1.025
SMILES CCCN1C(=O)CCc2cc(NS(=O)(=O)Cc3ccc(cc3)C3CC3)cc(Cl)c12
InChI Key InChIKey=XIJPCENAXMOUKD-UHFFFAOYSA-N
Data  2 IC50
  Tab Delimited (TSV)   2D SDfile   Computed 3D by Vconf -m prep SDfile
Find this compound or compounds like it in BindingDB:
Activity Spreadsheet -- Enzyme Inhibition Constant Data from BindingDB
Found 2 hits for monomerid = 313198
TargetAbscisic acid receptor PYL2/Protein phosphatase 2C 16(Arabidopsis thaliana (Mouse-ear cress))
University of California
US Patent
LigandPNGBDBM313198(N-(8-chloro-2-oxo-1-propyl-3,4-dihydroquinolin-6-y...)
Affinity DataIC50:  114nM. Assay description: HAB1 and PYL proteins were expressed and purified as described in Park et al. ((2009) Science 324(5930):1068-1071), with minor modifications. To obta...
Ligand InfoPC cidPC sid
In DepthDetails US Patent
TargetAbscisic acid receptor PYL1/Protein phosphatase 2C 16(Arabidopsis thaliana (Mouse-ear cress))
University of California
US Patent
LigandPNGBDBM313198(N-(8-chloro-2-oxo-1-propyl-3,4-dihydroquinolin-6-y...)
Affinity DataIC50:  83nM. Assay description: HAB1 and PYL proteins were expressed and purified as described in Park et al. ((2009) Science 324(5930):1068-1071), with minor modifications. To obta...
Ligand InfoPC cidPC sid
In DepthDetails US Patent