BDBM315512 US10172858, Table 2.8::US9828378, # 8
SMILES COc1ccc2cc([nH]c2c1)-c1nn(C(C)C)c2ncnc(N)c12
InChI Key InChIKey=OTYDSFTWYNMGFS-UHFFFAOYSA-N
Data  4 IC50
  Tab Delimited (TSV)   2D SDfile   Computed 3D by Vconf -m prep SDfile
Find this compound or compounds like it in BindingDB:
Activity Spreadsheet -- Enzyme Inhibition Constant Data from BindingDB
Found 4 hits for monomerid = 315512
TargetSerine/threonine-protein kinase mTOR(Homo sapiens (Human))
Intellikine
US Patent
LigandPNGBDBM315512(US10172858, Table 2.8 | US9828378, # 8)
Affinity DataIC50: >500nM. Assay description: This assay is relatively simple, reasonably sensitive, and the peptide substrate can be adjusted both in terms of sequence and concentration to meet ...
Ligand InfoPC cidPC sid
In DepthDetails US Patent
LigandPNGBDBM315512(US10172858, Table 2.8 | US9828378, # 8)
Affinity DataIC50: >500nM. Assay description: Class I PI3-Ks can be either purchased (p110α/p85α, p110β/p85α, p110δ/p85α from Upstate, and p110γ from Sigma) or...
Ligand InfoPC cidPC sid
In DepthDetails US Patent
TargetCytosolic arginine sensor for mTORC1 subunit 1(Homo sapiens (Human))
Intellikine
US Patent
LigandPNGBDBM315512(US10172858, Table 2.8 | US9828378, # 8)
Affinity DataIC50: >500nM. Assay description: Class I PI3-Ks can be either purchased (p110α/p85α, p110β/p85α, p110δ/p85α from Upstate, and p110γ from Sigma) or...
Ligand InfoPC cidPC sid
In DepthDetails US Patent
TargetPhosphatidylinositol 3-kinase regulatory subunit alpha(Homo sapiens (Human))
Intellikine
US Patent
LigandPNGBDBM315512(US10172858, Table 2.8 | US9828378, # 8)
Affinity DataIC50: >500nM. Assay description: This assay is relatively simple, reasonably sensitive, and the peptide substrate can be adjusted both in terms of sequence and concentration to meet ...
Ligand InfoPC cidPC sid
In DepthDetails US Patent