BDBM321962 (R,E)-3-(2-((5-Methyl-2H-tetrazol-2-yl)methyl)-4-(trifluoromethyl)phenyl)-1-(2-methyl-4-((2-methyloxazol-4-yl)methyl)piperazin-1-yl)prop-2-en-1-one::US10183025, Example 69::US9763957, Example 69
SMILES C[C@@H]1CN(Cc2coc(C)n2)CCN1C(=O)\C=C\c1ccc(cc1Cn1nnc(C)n1)C(F)(F)F
InChI Key InChIKey=VOGAWEJUJUFNDD-KEDPEKRHSA-N
Data  2 IC50
  Tab Delimited (TSV)   2D SDfile   Computed 3D by Vconf -m prep SDfile
Find this compound or compounds like it in BindingDB:
Activity Spreadsheet -- Enzyme Inhibition Constant Data from BindingDB
Found 2 hits for monomerid = 321962
TargetAtaxin-1(Homo sapiens (Human))
Novartis
US Patent
LigandPNGBDBM321962((R,E)-3-(2-((5-Methyl-2H-tetrazol-2-yl)methyl)-4-(...)
Affinity DataIC50:  2nM. Assay description: Method All experimental measurements were performed in black 384 well polystyrene (low volume, round bottom, Corning (3676)) plates. PerkinElmer EnVi...
Ligand InfoPC cidPC sid
In DepthDetails US Patent
TargetEctonucleotide pyrophosphatase/phosphodiesterase family member 2(Homo sapiens (Human))
Novartis
US Patent
LigandPNGBDBM321962((R,E)-3-(2-((5-Methyl-2H-tetrazol-2-yl)methyl)-4-(...)
Affinity DataIC50:  2nM. Assay description: Reagents LPC (oleoyl (18:1)) was purchased from Avanti Polar Lipids (Alabaster, Ala.) and solubilized in methanol to 20 mM. Amplex Red was obtained f...
Ligand InfoPC cidPC sid
In DepthDetails US Patent