BDBM32345 MLS000391610::N'-(2-benzo[cd]indolyl)-4-bromobenzohydrazide::N'-benzo[cd]indol-2-yl-4-bromanyl-benzohydrazide::N'-benzo[cd]indol-2-yl-4-bromo-benzohydrazide::N'-benzo[cd]indol-2-yl-4-bromobenzohydrazide::SMR000260645::cid_5044744
SMILES Brc1ccc(cc1)C(=O)NNC1=Nc2cccc3cccc1c23
InChI Key InChIKey=YEGFDPRPLRNQKO-UHFFFAOYSA-N
Data  5 IC50  1 EC50
  Tab Delimited (TSV)   2D SDfile   Computed 3D by Vconf -m prep SDfile
Find this compound or compounds like it in BindingDB:
Activity Spreadsheet -- Enzyme Inhibition Constant Data from BindingDB
Found 6 hits for monomerid = 32345
TargetSerine/threonine-protein kinase D1(Homo sapiens (Human))
University of Pittsburgh
Curated by PubChem BioAssay
LigandPNGBDBM32345(MLS000391610 | N'-(2-benzo[cd]indolyl)-4-bromobenz...)
Affinity DataIC50: >5.00E+4nMpH: 7.2 T: 2°C. Assay description: The PKD HTS assay was developed and run at the University of Pittsburgh Molecular Screening Center (PMLSC) as part of the Molecular Library Screening...
In DepthDetails PCBioAssay
TargetRAC-alpha serine/threonine-protein kinase(Homo sapiens (Human))
University of Pittsburgh
Curated by PubChem BioAssay
LigandPNGBDBM32345(MLS000391610 | N'-(2-benzo[cd]indolyl)-4-bromobenz...)
Affinity DataIC50: >1.00E+5nM. Assay description: The PKD HTS assay was developed and run at the University of Pittsburgh Molecular Screening Center (PMLSC) as part of the Molecular Library Screening...
In DepthDetails PCBioAssay
TargetStreptokinase A(Streptococcus pyogenes M1 GAS)
Broad Institute
Curated by PubChem BioAssay
LigandPNGBDBM32345(MLS000391610 | N'-(2-benzo[cd]indolyl)-4-bromobenz...)
Affinity DataEC50:  1.50E+5nM. Assay description: Keywords: Group A streptococcus, GAS, streptokinase, expression, virulence, inhibition, dose response, EC50 Assay Overview: The goal of this assa...
In DepthDetails PCBioAssay
TargetSerine/threonine-protein kinase D1(Homo sapiens (Human))
University of Pittsburgh
Curated by PubChem BioAssay
LigandPNGBDBM32345(MLS000391610 | N'-(2-benzo[cd]indolyl)-4-bromobenz...)
Affinity DataIC50: >5.00E+4nM. Assay description: The PKD HTS assay was developed and run at the University of Pittsburgh Molecular Screening Center (PMLSC) as part of the Molecular Library Screening...
In DepthDetails PCBioAssay
TargetGlycoprotein 42(Human herpesvirus 4 type 2)
Emory University
Curated by PubChem BioAssay
LigandPNGBDBM32345(MLS000391610 | N'-(2-benzo[cd]indolyl)-4-bromobenz...)
Affinity DataIC50:  2.73E+3nM. Assay description: NIH Molecular Libraries Screening Centers Network [MLSCN] Emory Chemical Biology Discovery Center in MLSCN Assay provider: Theodore Jardetzky; Northw...
In DepthDetails PCBioAssay
TargetCyclin-dependent kinase 7(Homo sapiens (Human))
University of Pittsburgh
Curated by PubChem BioAssay
LigandPNGBDBM32345(MLS000391610 | N'-(2-benzo[cd]indolyl)-4-bromobenz...)
Affinity DataIC50: >1.00E+5nM. Assay description: The PKD HTS assay was developed and run at the University of Pittsburgh Molecular Screening Center (PMLSC) as part of the Molecular Library Screening...
In DepthDetails PCBioAssay