BDBM32349 MLS000688854::N'-(2-furanylmethyl)-N-(5-methyl-3-isoxazolyl)-N'-[2-oxo-2-(2-oxolanylmethylamino)-1-pyridin-4-ylethyl]butanediamide::N'-(2-furfuryl)-N'-[2-keto-1-(4-pyridyl)-2-(tetrahydrofurfurylamino)ethyl]-N-(5-methylisoxazol-3-yl)succinamide::N'-(furan-2-ylmethyl)-N-(5-methyl-1,2-oxazol-3-yl)-N'-[2-oxidanylidene-2-(oxolan-2-ylmethylamino)-1-pyridin-4-yl-ethyl]butanediamide::N'-(furan-2-ylmethyl)-N-(5-methyl-1,2-oxazol-3-yl)-N'-[2-oxo-2-(oxolan-2-ylmethylamino)-1-pyridin-4-ylethyl]butanediamide::SMR000285740::cid_3210804
SMILES Cc1cc(NC(=O)CCC(=O)N(Cc2ccco2)C(C(=O)NCC2CCCO2)c2ccncc2)no1
InChI Key InChIKey=QQQMLAFGEUIECA-UHFFFAOYSA-N
Data  4 IC50
  Tab Delimited (TSV)   2D SDfile   Computed 3D by Vconf -m prep SDfile
Find this compound or compounds like it in BindingDB:
Activity Spreadsheet -- Enzyme Inhibition Constant Data from BindingDB
Found 4 hits for monomerid = 32349
TargetSerine/threonine-protein kinase D1(Homo sapiens (Human))
University of Pittsburgh
Curated by PubChem BioAssay
LigandPNGBDBM32349(MLS000688854 | N'-(2-furanylmethyl)-N-(5-methyl-3-...)
Affinity DataIC50: >5.00E+4nMpH: 7.2 T: 2°C. Assay description: The PKD HTS assay was developed and run at the University of Pittsburgh Molecular Screening Center (PMLSC) as part of the Molecular Library Screening...
In DepthDetails PCBioAssay
TargetSerine/threonine-protein kinase D1(Homo sapiens (Human))
University of Pittsburgh
Curated by PubChem BioAssay
LigandPNGBDBM32349(MLS000688854 | N'-(2-furanylmethyl)-N-(5-methyl-3-...)
Affinity DataIC50: >5.00E+4nM. Assay description: The PKD HTS assay was developed and run at the University of Pittsburgh Molecular Screening Center (PMLSC) as part of the Molecular Library Screening...
In DepthDetails PCBioAssay
TargetCyclin-dependent kinase 7(Homo sapiens (Human))
University of Pittsburgh
Curated by PubChem BioAssay
LigandPNGBDBM32349(MLS000688854 | N'-(2-furanylmethyl)-N-(5-methyl-3-...)
Affinity DataIC50: >1.00E+5nM. Assay description: The PKD HTS assay was developed and run at the University of Pittsburgh Molecular Screening Center (PMLSC) as part of the Molecular Library Screening...
In DepthDetails PCBioAssay
TargetRAC-alpha serine/threonine-protein kinase(Homo sapiens (Human))
University of Pittsburgh
Curated by PubChem BioAssay
LigandPNGBDBM32349(MLS000688854 | N'-(2-furanylmethyl)-N-(5-methyl-3-...)
Affinity DataIC50: >1.00E+5nM. Assay description: The PKD HTS assay was developed and run at the University of Pittsburgh Molecular Screening Center (PMLSC) as part of the Molecular Library Screening...
In DepthDetails PCBioAssay