BDBM337798 2,4-Dioxo-1-[4-(2-oxoimidazolidin-1-yl)phenyl]-3-[(1R)-4-(trifluoromethyl)-2,3-dihydro-1H-inden-1-yl]-1,2,3,4-tetrahydropyrimidine-5-carboxylic acid::US9751843, 192
SMILES OC(=O)c1cn(-c2ccc(cc2)N2CCNC2=O)c(=O)n(C2CCc3c2cccc3C(F)(F)F)c1=O
InChI Key InChIKey=GYIIOALYEZWDBK-UHFFFAOYSA-N
Data  1 IC50
  Tab Delimited (TSV)   2D SDfile   Computed 3D by Vconf -m prep SDfile
Find this compound or compounds like it in BindingDB:
Activity Spreadsheet -- Enzyme Inhibition Constant Data from BindingDB
Found 1 hit for monomerid = 337798
TargetChymase(Homo sapiens (Human))
Bayer Pharma Aktiengesellschaft
US Patent
LigandPNGBDBM337798(2,4-Dioxo-1-[4-(2-oxoimidazolidin-1-yl)phenyl]-3-[...)
Affinity DataIC50:  54nM. Assay description: The enzyme source used is recombinant human chymase (expressed in HEK293 cells) or chymase purified from hamsters' tongues. The substrate used fo...
Ligand InfoPC cidPC sid
In DepthDetails US Patent