BDBM33811 1-[5-(p-anisylamino)-3-(3-pyridyl)-1,2,4-triazol-1-yl]butan-1-one::1-[5-[(4-methoxyphenyl)methylamino]-3-(3-pyridinyl)-1,2,4-triazol-1-yl]-1-butanone::1-[5-[(4-methoxyphenyl)methylamino]-3-pyridin-3-yl-1,2,4-triazol-1-yl]butan-1-one::MLS000719016::SMR000291284::US9687479, 330 1-(5-[(4-methoxyphenyl)methyl]amino-3-(pyridin-3-yl)-1H-1,2,4-triazol-1-yl)butan-1-one::cid_4007214
SMILES CCCC(=O)n1nc(nc1NCc1ccc(OC)cc1)-c1cccnc1
InChI Key InChIKey=GPRVGNYBRCIJBM-UHFFFAOYSA-N
Data  2 IC50
  Tab Delimited (TSV)   2D SDfile   Computed 3D by Vconf -m prep SDfile
Find this compound or compounds like it in BindingDB:
Activity Spreadsheet -- Enzyme Inhibition Constant Data from BindingDB
Found 2 hits for monomerid = 33811
TargetPlasma kallikrein(Homo sapiens (Human))
Verseon
US Patent
LigandPNGBDBM33811(1-[5-(p-anisylamino)-3-(3-pyridyl)-1,2,4-triazol-1...)
Affinity DataIC50:  5.50E+4nMpH: 7.4 T: 2°C. Assay description: Human KLKB1 protein was obtained from Enzyme Research Labs. The chromogenic substrate S-2302 was obtained from DiaPharma. KLKB1 was assayed in buffer...
In DepthDetails US Patent
TargetProthrombin(Homo sapiens (Human))
Pcmd
Curated by PubChem BioAssay
LigandPNGBDBM33811(1-[5-(p-anisylamino)-3-(3-pyridyl)-1,2,4-triazol-1...)
Affinity DataIC50:  88.3nMpH: 7.5 T: 2°C. Assay description: HTS was performed using 217,350 compounds of the MLSCN library individually plated into 10ul 1536 compound plates at a concentration of 2.5 mM each, ...
In DepthDetails PCBioAssay