BDBM33866 1-(2-furoyl)-N-(2-furylmethyl)-3-pyridin-3-yl-1H-1,2,4-triazol-5-amine::2-furanyl-[5-(2-furanylmethylamino)-3-(3-pyridinyl)-1,2,4-triazol-1-yl]methanone::MLS000660757::SMR000310275::[5-(2-furfurylamino)-3-(3-pyridyl)-1,2,4-triazol-1-yl]-(2-furyl)methanone::cid_4580065::furan-2-yl-[5-(furan-2-ylmethylamino)-3-pyridin-3-yl-1,2,4-triazol-1-yl]methanone
SMILES O=C(c1ccco1)n1nc(nc1NCc1ccco1)-c1cccnc1
InChI Key InChIKey=OZZFNYNSTKJOIL-UHFFFAOYSA-N
Data  1 IC50
  Tab Delimited (TSV)   2D SDfile   Computed 3D by Vconf -m prep SDfile
Find this compound or compounds like it in BindingDB:
Activity Spreadsheet -- Enzyme Inhibition Constant Data from BindingDB
Found 1 hit for monomerid = 33866
TargetProthrombin(Homo sapiens (Human))
Pcmd
Curated by PubChem BioAssay
LigandPNGBDBM33866(1-(2-furoyl)-N-(2-furylmethyl)-3-pyridin-3-yl-1H-1...)
Affinity DataIC50:  134nMpH: 7.5 T: 2°C. Assay description: HTS was performed using 217,350 compounds of the MLSCN library individually plated into 10ul 1536 compound plates at a concentration of 2.5 mM each, ...
In DepthDetails PCBioAssay