BDBM338911 (1S,2S)-3-amino-1-(3-((E)-2-(1- hydroxycyclohexyl)vinyl)phenyl)propane-1,2-diol::US10201545, Compound 117
SMILES NC[C@H](O)[C@@H](O)c1cccc(\C=C\C2(O)CCCCC2)c1
InChI Key InChIKey=VOKMZZIOFRASRQ-MOVUHUBBSA-N
Data  1 IC50
  Tab Delimited (TSV)   2D SDfile   Computed 3D by Vconf -m prep SDfile
Find this compound or compounds like it in BindingDB:
Activity Spreadsheet -- Enzyme Inhibition Constant Data from BindingDB
Found 1 hit for monomerid = 338911
TargetRetinaldehyde-binding protein 1(Homo sapiens (Human))
Acucela
US Patent
LigandPNGBDBM338911((1S,2S)-3-amino-1-(3-((E)-2-(1- hydroxycyclohexyl)...)
Affinity DataIC50: <100nM. Assay description: The isomerase assay was performed in 10 mM bis-tris-propane (BTP) buffer, pH 7.5, 0.5% BSA (diluted in BTP buffer), 1 mM sodium pyrophosphate, 20 ...
Ligand InfoPC cidPC sid
In DepthDetails US Patent