BDBM338921 (E)-2-(3-(2-(2,6,6-trimethylcyclohex-1- enyl)vinyl)phenoxy)ethanamine::US10201545, Compound 31
SMILES CC1=C(\C=C\c2cccc(OCCN)c2)C(C)(C)CCC1
InChI Key InChIKey=DRHCFRQFKCNMCN-MDZDMXLPSA-N
Data  1 IC50
  Tab Delimited (TSV)   2D SDfile   Computed 3D by Vconf -m prep SDfile
Find this compound or compounds like it in BindingDB:
Activity Spreadsheet -- Enzyme Inhibition Constant Data from BindingDB
Found 1 hit for monomerid = 338921
TargetRetinaldehyde-binding protein 1(Homo sapiens (Human))
Acucela
US Patent
LigandPNGBDBM338921((E)-2-(3-(2-(2,6,6-trimethylcyclohex-1- enyl)vinyl...)
Affinity DataIC50: <1.00E+3nM. Assay description: The isomerase assay was performed in 10 mM bis-tris-propane (BTP) buffer, pH 7.5, 0.5% BSA (diluted in BTP buffer), 1 mM sodium pyrophosphate, 20 ...
Ligand InfoPC cidPC sid
In DepthDetails US Patent