BDBM338931 (E)-3-amino-1-(3-(2-(2,6,6-trimethylcyclohex-1- enyl)vinyl)phenyl)propan-1-one::US10201545, Compound 56
SMILES CC1=C(\C=C\c2cccc(c2)C(=O)CCN)C(C)(C)CCC1
InChI Key InChIKey=BUUMFQMGBUREOX-MDZDMXLPSA-N
Data  1 IC50
  Tab Delimited (TSV)   2D SDfile   Computed 3D by Vconf -m prep SDfile
Find this compound or compounds like it in BindingDB:
Activity Spreadsheet -- Enzyme Inhibition Constant Data from BindingDB
Found 1 hit for monomerid = 338931
TargetRetinaldehyde-binding protein 1(Homo sapiens (Human))
Acucela
US Patent
LigandPNGBDBM338931((E)-3-amino-1-(3-(2-(2,6,6-trimethylcyclohex-1- en...)
Affinity DataIC50: <1.00E+3nM. Assay description: The isomerase assay was performed in 10 mM bis-tris-propane (BTP) buffer, pH 7.5, 0.5% BSA (diluted in BTP buffer), 1 mM sodium pyrophosphate, 20 ...
Ligand InfoPC cidPC sid
In DepthDetails US Patent