BDBM338932 (E)-3-amino-2-methyl-1-(3-(2-(2,6,6-trimethylcyclohex- 1-enyl)vinyl)phenyl)propan-1-ol::US10201545, Compound 59
SMILES CC(CN)C(O)c1cccc(\C=C\C2=C(C)CCCC2(C)C)c1
InChI Key InChIKey=FXKCGXJBFRUOSM-ZHACJKMWSA-N
Data  1 IC50
  Tab Delimited (TSV)   2D SDfile   Computed 3D by Vconf -m prep SDfile
Find this compound or compounds like it in BindingDB:
Activity Spreadsheet -- Enzyme Inhibition Constant Data from BindingDB
Found 1 hit for monomerid = 338932
TargetRetinaldehyde-binding protein 1(Homo sapiens (Human))
Acucela
US Patent
LigandPNGBDBM338932((E)-3-amino-2-methyl-1-(3-(2-(2,6,6-trimethylcyclo...)
Affinity DataIC50: <1.00E+3nM. Assay description: The isomerase assay was performed in 10 mM bis-tris-propane (BTP) buffer, pH 7.5, 0.5% BSA (diluted in BTP buffer), 1 mM sodium pyrophosphate, 20 ...
Ligand InfoPC cidPC sid
In DepthDetails US Patent