BDBM338939 (S,E)-1-amino-3-(3-(2,6-dichlorostyryl)phenyl)propan- 2-ol::US10201545, Compound 75
SMILES NC[C@@H](O)Cc1cccc(\C=C\c2c(Cl)cccc2Cl)c1
InChI Key InChIKey=GFQWMSQANCSPPQ-NPQIQWPPSA-N
Data  1 IC50
  Tab Delimited (TSV)   2D SDfile   Computed 3D by Vconf -m prep SDfile
Find this compound or compounds like it in BindingDB:
Activity Spreadsheet -- Enzyme Inhibition Constant Data from BindingDB
Found 1 hit for monomerid = 338939
TargetRetinaldehyde-binding protein 1(Homo sapiens (Human))
Acucela
US Patent
LigandPNGBDBM338939((S,E)-1-amino-3-(3-(2,6-dichlorostyryl)phenyl)prop...)
Affinity DataIC50: <1.00E+3nM. Assay description: The isomerase assay was performed in 10 mM bis-tris-propane (BTP) buffer, pH 7.5, 0.5% BSA (diluted in BTP buffer), 1 mM sodium pyrophosphate, 20 ...
Ligand InfoPC cidPC sid
In DepthDetails US Patent