BDBM338949 (E)-1-(3-(3-aminopropyl)phenyl)-3-ethylpent-1-en-3-ol::US10201545, Compound 100
SMILES CCC(O)(CC)\C=C\c1cccc(CCCN)c1
InChI Key InChIKey=WZAMHIIJKHBBSF-ZHACJKMWSA-N
Data  1 IC50
  Tab Delimited (TSV)   2D SDfile   Computed 3D by Vconf -m prep SDfile
Find this compound or compounds like it in BindingDB:
Activity Spreadsheet -- Enzyme Inhibition Constant Data from BindingDB
Found 1 hit for monomerid = 338949
TargetRetinaldehyde-binding protein 1(Homo sapiens (Human))
Acucela
US Patent
LigandPNGBDBM338949((E)-1-(3-(3-aminopropyl)phenyl)-3-ethylpent-1-en-3...)
Affinity DataIC50: <1.00E+3nM. Assay description: The isomerase assay was performed in 10 mM bis-tris-propane (BTP) buffer, pH 7.5, 0.5% BSA (diluted in BTP buffer), 1 mM sodium pyrophosphate, 20 ...
Ligand InfoPC cidPC sid
In DepthDetails US Patent