BDBM338979 (E)-3-methoxy-N-methyl-3-(3-(2-(2,6,6- trimethylcyclohex-1-enyl)vinyl)phenyl)propan-1-amine::US10201545, Compound 63
SMILES CNCCC(OC)c1cccc(\C=C\C2=C(C)CCCC2(C)C)c1
InChI Key InChIKey=FEYOSYWCENBTJX-VAWYXSNFSA-N
Data  1 IC50
  Tab Delimited (TSV)   2D SDfile   Computed 3D by Vconf -m prep SDfile
Find this compound or compounds like it in BindingDB:
Activity Spreadsheet -- Enzyme Inhibition Constant Data from BindingDB
Found 1 hit for monomerid = 338979
TargetRetinaldehyde-binding protein 1(Homo sapiens (Human))
Acucela
US Patent
LigandPNGBDBM338979((E)-3-methoxy-N-methyl-3-(3-(2-(2,6,6- trimethylcy...)
Affinity DataIC50: <1.00E+4nM. Assay description: The isomerase assay was performed in 10 mM bis-tris-propane (BTP) buffer, pH 7.5, 0.5% BSA (diluted in BTP buffer), 1 mM sodium pyrophosphate, 20 ...
Ligand InfoPC cidPC sid
In DepthDetails US Patent