BDBM340185 (S)-4-(3-(1-acryloylpyrrolidin-2-yl)- 8-aminoimidazo[1,5-a]pyrazin-1-yl)- N-(4-cyanopyridin-2-yl)benzamide::US10239883, Example 122::US10934296, Example 122::US9758524, Example 122
SMILES Nc1nccn2c(nc(-c3ccc(cc3)C(=O)Nc3cc(ccn3)C#N)c12)[C@@H]1CCCN1C(=O)C=C
InChI Key InChIKey=QXUSAIWDESXIER-IBGZPJMESA-N
Data  15 EC50
  Tab Delimited (TSV)   2D SDfile   Computed 3D by Vconf -m prep SDfile
Find this compound or compounds like it in BindingDB:
Activity Spreadsheet -- Enzyme Inhibition Constant Data from BindingDB
Found 15 hits for monomerid = 340185
TargetTyrosine-protein kinase BTK(Homo sapiens (Human))
Merck Sharp & Dohme
US Patent
LigandPNGBDBM340185((S)-4-(3-(1-acryloylpyrrolidin-2-yl)- 8-aminoimida...)
Affinity DataEC50: <10nM. Assay description: Btk enzyme (His-Btk (Millipore catalog #14-552), is diluted to 0.4 U/mL in KR buffer (10 mM Tris-HCl, 10 mM MgCl2, 0.01% Tween-20, 0.05% NaN3, 1 mM D...
Ligand InfoPC cidPC sid
In DepthDetails US Patent
TargetTyrosine-protein kinase Lck(Homo sapiens (Human))
Merck Sharp & Dohme
US Patent
LigandPNGBDBM340185((S)-4-(3-(1-acryloylpyrrolidin-2-yl)- 8-aminoimida...)
Affinity DataEC50:  550nM. Assay description: Lck enzyme activity is measured using the IMAP (immobilized metal ion affinity-based fluorescence polarization) assay as outlined below.Lck enzyme (M...
Ligand InfoPC cidPC sid
In DepthDetails US Patent
TargetProto-oncogene tyrosine-protein kinase Src(Homo sapiens (Human))
Merck Sharp & Dohme
US Patent
LigandPNGBDBM340185((S)-4-(3-(1-acryloylpyrrolidin-2-yl)- 8-aminoimida...)
Affinity DataEC50: >1.00E+3nM. Assay description: Src enzyme activity is measured using the IMAP (immobilized metal ion affinity-based fluorescence polarization) assay as outlined below.Src enzyme (M...
Ligand InfoPC cidPC sid
In DepthDetails US Patent
TargetTyrosine-protein kinase Fyn(Homo sapiens (Human))
Merck Sharp & Dohme
US Patent
LigandPNGBDBM340185((S)-4-(3-(1-acryloylpyrrolidin-2-yl)- 8-aminoimida...)
Affinity DataEC50: >1.00E+3nM. Assay description: FynT enzyme activity is measured using the IMAP (immobilized metal ion affinity-based fluorescence polarization) assay as outlined below.FynT enzyme ...
Ligand InfoPC cidPC sid
In DepthDetails US Patent
TargetTyrosine-protein kinase Lyn(Homo sapiens (Human))
Merck Sharp & Dohme
US Patent
LigandPNGBDBM340185((S)-4-(3-(1-acryloylpyrrolidin-2-yl)- 8-aminoimida...)
Affinity DataEC50: >1.00E+3nM. Assay description: Lyn enzyme activity is measured using the IMAP (immobilized metal ion affinity-based fluorescence polarization) assay as outlined below.Lyn enzyme (M...
Ligand InfoPC cidPC sid
In DepthDetails US Patent
TargetTyrosine-protein kinase BTK(Homo sapiens (Human))
Merck Sharp & Dohme
US Patent
LigandPNGBDBM340185((S)-4-(3-(1-acryloylpyrrolidin-2-yl)- 8-aminoimida...)
Affinity DataEC50: <10nM. Assay description: Btk enzyme (His-Btk (Millipore catalog #14-552), is diluted to 0.4 U/mL in KR buffer (10 mM Tris-HCl, 10 mM MgCl2, 0.01% Tween-20, 0.05% NaN3, 1 mM D...
Ligand InfoPC cidPC sid
In DepthDetails US Patent
TargetTyrosine-protein kinase Lck(Homo sapiens (Human))
Merck Sharp & Dohme
US Patent
LigandPNGBDBM340185((S)-4-(3-(1-acryloylpyrrolidin-2-yl)- 8-aminoimida...)
Affinity DataEC50:  550nM. Assay description: Lck enzyme (Millipore catalog #14-442), is diluted to 0.4 U/mL in KR buffer (10 mM Tris-HCl, 10 mM MgCl2, 0.01% Tween-20, 0.05% NaN3, 1 mM DTT, 2 mM ...
Ligand InfoPC cidPC sid
In DepthDetails US Patent
TargetProto-oncogene tyrosine-protein kinase Src(Homo sapiens (Human))
Merck Sharp & Dohme
US Patent
LigandPNGBDBM340185((S)-4-(3-(1-acryloylpyrrolidin-2-yl)- 8-aminoimida...)
Affinity DataEC50: >1.00E+3nM. Assay description: Src enzyme (Millipore catalog #14-326), is diluted to 0.8 U/mL in KR buffer (10 mM Tris-HCl, 10 mM MgCl2, 0.01% Tween-20, 0.05% NaN3, 1 mM DTT, 2 mM ...
Ligand InfoPC cidPC sid
In DepthDetails US Patent
TargetTyrosine-protein kinase Fyn(Homo sapiens (Human))
Merck Sharp & Dohme
US Patent
LigandPNGBDBM340185((S)-4-(3-(1-acryloylpyrrolidin-2-yl)- 8-aminoimida...)
Affinity DataEC50: >1.00E+3nM. Assay description: FynT enzyme (Biomol catalog #SE-287), is diluted to 0.5 μg/mL in KR buffer (10 mM Tris-HCl, 10 mM MgCl2, 0.01% Tween-20, 0.05% NaN3, 1 mM DTT, 2...
Ligand InfoPC cidPC sid
In DepthDetails US Patent
TargetTyrosine-protein kinase Lyn(Homo sapiens (Human))
Merck Sharp & Dohme
US Patent
LigandPNGBDBM340185((S)-4-(3-(1-acryloylpyrrolidin-2-yl)- 8-aminoimida...)
Affinity DataEC50: >1.00E+3nM. Assay description: Lyn enzyme (Millipore catalog #14-510), is diluted to 250 mU/mL in KR buffer (10 mM Tris-HCl, 10 mM MgCl2, 0.01% Tween-20, 0.05% NaN3, 1 mM DTT, 2 mM...
Ligand InfoPC cidPC sid
In DepthDetails US Patent
TargetProto-oncogene tyrosine-protein kinase Src(Homo sapiens (Human))
Merck Sharp & Dohme
US Patent
LigandPNGBDBM340185((S)-4-(3-(1-acryloylpyrrolidin-2-yl)- 8-aminoimida...)
Affinity DataEC50: >1.00E+3nM. Assay description: Src enzyme activity is measured using the IMAP (immobilized metal ion affinity-based fluorescence polarization) assay as outlined below.Src enzyme (M...
Ligand InfoPC cidPC sid
In DepthDetails US Patent
TargetTyrosine-protein kinase Fyn(Homo sapiens (Human))
Merck Sharp & Dohme
US Patent
LigandPNGBDBM340185((S)-4-(3-(1-acryloylpyrrolidin-2-yl)- 8-aminoimida...)
Affinity DataEC50: >1.00E+3nM. Assay description: FynT enzyme activity is measured using the IMAP (immobilized metal ion affinity-based fluorescence polarization) assay as outlined below.FynT enzyme ...
Ligand InfoPC cidPC sid
In DepthDetails US Patent
TargetTyrosine-protein kinase Lyn(Homo sapiens (Human))
Merck Sharp & Dohme
US Patent
LigandPNGBDBM340185((S)-4-(3-(1-acryloylpyrrolidin-2-yl)- 8-aminoimida...)
Affinity DataEC50: >1.00E+3nM. Assay description: Lyn enzyme activity is measured using the IMAP (immobilized metal ion affinity-based fluorescence polarization) assay as outlined below.Lyn enzyme (M...
Ligand InfoPC cidPC sid
In DepthDetails US Patent
TargetTyrosine-protein kinase BTK(Homo sapiens (Human))
Merck Sharp & Dohme
US Patent
LigandPNGBDBM340185((S)-4-(3-(1-acryloylpyrrolidin-2-yl)- 8-aminoimida...)
Affinity DataEC50: <10nM. Assay description: Btk enzyme activity is measured using the IMAP (immobilized metal ion affinity-based fluorescence polarization) assay as outlined below.Btk enzyme (H...
Ligand InfoPC cidPC sid
In DepthDetails US Patent
TargetTyrosine-protein kinase Lck(Homo sapiens (Human))
Merck Sharp & Dohme
US Patent
LigandPNGBDBM340185((S)-4-(3-(1-acryloylpyrrolidin-2-yl)- 8-aminoimida...)
Affinity DataEC50:  550nM. Assay description: Lck enzyme activity is measured using the IMAP (immobilized metal ion affinity-based fluorescence polarization) assay as outlined below.Lck enzyme (M...
Ligand InfoPC cidPC sid
In DepthDetails US Patent