BDBM356538 N-[3-(5-{1-[1-(Cyclopropylacetyl)piperidin-4-yl]-1H-pyrazol-4-yl}-1H-benzimidazol-1-yl)phenyl]-N′-(2,2,2-trifluoroethyl)urea::US10213427, Example 27::US10813930, Ex. No. 27
SMILES FC(F)(F)CNC(=O)Nc1cccc(c1)-n1cnc2cc(ccc12)-c1cnn(c1)C1CCN(CC1)C(=O)CC1CC1
InChI Key InChIKey=ASBZBUFAZDKVIZ-UHFFFAOYSA-N
Data  2 IC50
  Tab Delimited (TSV)   2D SDfile   Computed 3D by Vconf -m prep SDfile
Find this compound or compounds like it in BindingDB:
Activity Spreadsheet -- Enzyme Inhibition Constant Data from BindingDB
Found 1 hit for monomerid = 356538
TargetFibroblast growth factor receptor 3(Homo sapiens (Human))
Incyte
US Patent
LigandPNGBDBM356538(N-[3-(5-{1-[1-(Cyclopropylacetyl)piperidin-4-yl]-1...)
Affinity DataIC50: <10nM. Assay description: The inhibitor potency of compounds of the invention was measured in an enzyme assay that measures peptide phosphorylation using FRET measurements to ...
Ligand InfoPC cidPC sid
In DepthDetails US Patent