BDBM360664 US9828378, # 4
SMILES CC(C)n1nc(-c2cc3cc(ccc3[nH]2)C#N)c2c(N)ncnc12
InChI Key InChIKey=UPAWMIJMCTTYQN-UHFFFAOYSA-N
Data  2 IC50
  Tab Delimited (TSV)   2D SDfile   Computed 3D by Vconf -m prep SDfile
Find this compound or compounds like it in BindingDB:
Activity Spreadsheet -- Enzyme Inhibition Constant Data from BindingDB
Found 2 hits for monomerid = 360664
LigandPNGBDBM360664(US9828378, # 4)
Affinity DataIC50: >500nM. Assay description: Class I PI3-Ks can be either purchased (p110α/p85α, p110β/p85α, p110δ/p85α from Upstate, and p110γ from Sigma) or...
Ligand InfoPC cidPC sid
In DepthDetails US Patent
TargetCytosolic arginine sensor for mTORC1 subunit 1(Homo sapiens (Human))
Intellikine
US Patent
LigandPNGBDBM360664(US9828378, # 4)
Affinity DataIC50: >500nM. Assay description: Class I PI3-Ks can be either purchased (p110α/p85α, p110β/p85α, p110δ/p85α from Upstate, and p110γ from Sigma) or...
Ligand InfoPC cidPC sid
In DepthDetails US Patent