BDBM362204 US9834548, Example 18
SMILES CC(=O)N1CCN(CC1)c1ccc(Nc2cc(NCc3ccccc3F)c(nn2)C(N)=O)cc1
InChI Key InChIKey=IIZJQROZPHMWQE-UHFFFAOYSA-N
Data  4 IC50
  Tab Delimited (TSV)   2D SDfile   Computed 3D by Vconf -m prep SDfile
Find this compound or compounds like it in BindingDB:
Activity Spreadsheet -- Enzyme Inhibition Constant Data from BindingDB
Found 4 hits for monomerid = 362204
TargetTyrosine-protein kinase JAK1(Homo sapiens (Human))
Portola Pharmaceuticals
US Patent
LigandPNGBDBM362204(US9834548, Example 18)
Affinity DataIC50:  550nM
Ligand InfoPC cidPC sid
In DepthDetails US Patent
TargetNon-receptor tyrosine-protein kinase TYK2(Homo sapiens (Human))
Portola Pharmaceuticals
US Patent
LigandPNGBDBM362204(US9834548, Example 18)
Affinity DataIC50:  550nM
Ligand InfoPC cidPC sid
In DepthDetails US Patent
TargetTyrosine-protein kinase JAK3(Homo sapiens (Human))
Portola Pharmaceuticals
US Patent
LigandPNGBDBM362204(US9834548, Example 18)
Affinity DataIC50:  5.5nM
Ligand InfoPC cidPC sid
In DepthDetails US Patent
TargetTyrosine-protein kinase JAK2(Homo sapiens (Human))
Portola Pharmaceuticals
US Patent
LigandPNGBDBM362204(US9834548, Example 18)
Affinity DataIC50:  550nM
Ligand InfoPC cidPC sid
In DepthDetails US Patent