BDBM362208 US9834548, Example 20
SMILES CC(=O)N1CCN(CC1)c1ccc(Nc2cc(NCc3cc(F)cc(F)c3)c(nn2)C(N)=O)cc1
InChI Key InChIKey=KFEMLKMJMUVGFB-UHFFFAOYSA-N
Data  4 IC50
  Tab Delimited (TSV)   2D SDfile   Computed 3D by Vconf -m prep SDfile
Find this compound or compounds like it in BindingDB:
Activity Spreadsheet -- Enzyme Inhibition Constant Data from BindingDB
Found 4 hits for monomerid = 362208
TargetTyrosine-protein kinase JAK1(Homo sapiens (Human))
Portola Pharmaceuticals
US Patent
LigandPNGBDBM362208(US9834548, Example 20)
Affinity DataIC50:  550nM
Ligand InfoPC cidPC sid
In DepthDetails US Patent
TargetNon-receptor tyrosine-protein kinase TYK2(Homo sapiens (Human))
Portola Pharmaceuticals
US Patent
LigandPNGBDBM362208(US9834548, Example 20)
Affinity DataIC50:  550nM
Ligand InfoPC cidPC sid
In DepthDetails US Patent
TargetTyrosine-protein kinase JAK3(Homo sapiens (Human))
Portola Pharmaceuticals
US Patent
LigandPNGBDBM362208(US9834548, Example 20)
Affinity DataIC50:  5.5nM
Ligand InfoPC cidPC sid
In DepthDetails US Patent
TargetTyrosine-protein kinase JAK2(Homo sapiens (Human))
Portola Pharmaceuticals
US Patent
LigandPNGBDBM362208(US9834548, Example 20)
Affinity DataIC50:  55nM
Ligand InfoPC cidPC sid
In DepthDetails US Patent