BDBM362225 US9834548, Example 32
SMILES CCC(=O)N1CCN(CC1)c1ccc(Nc2cc(NCc3cc(F)ccc3F)c(nn2)C(N)=O)cc1
InChI Key InChIKey=KMEUATNBUNVTJM-UHFFFAOYSA-N
Data  3 IC50
  Tab Delimited (TSV)   2D SDfile   Computed 3D by Vconf -m prep SDfile
Find this compound or compounds like it in BindingDB:
Activity Spreadsheet -- Enzyme Inhibition Constant Data from BindingDB
Found 3 hits for monomerid = 362225
TargetTyrosine-protein kinase JAK1(Homo sapiens (Human))
Portola Pharmaceuticals
US Patent
LigandPNGBDBM362225(US9834548, Example 32)
Affinity DataIC50: >1.00E+3nM
Ligand InfoPC cidPC sid
In DepthDetails US Patent
TargetTyrosine-protein kinase JAK3(Homo sapiens (Human))
Portola Pharmaceuticals
US Patent
LigandPNGBDBM362225(US9834548, Example 32)
Affinity DataIC50:  5.5nM
Ligand InfoPC cidPC sid
In DepthDetails US Patent
TargetTyrosine-protein kinase JAK2(Homo sapiens (Human))
Portola Pharmaceuticals
US Patent
LigandPNGBDBM362225(US9834548, Example 32)
Affinity DataIC50:  55nM
Ligand InfoPC cidPC sid
In DepthDetails US Patent