BDBM362323 US9834548, Example 112
SMILES CC(C)n1cc(Nc2cc(NCc3cccc4ccsc34)c(nn2)C(N)=O)cn1
InChI Key InChIKey=YGGJEHJXDXUTLU-UHFFFAOYSA-N
Data  3 IC50
  Tab Delimited (TSV)   2D SDfile   Computed 3D by Vconf -m prep SDfile
Find this compound or compounds like it in BindingDB:
Activity Spreadsheet -- Enzyme Inhibition Constant Data from BindingDB
Found 3 hits for monomerid = 362323
TargetTyrosine-protein kinase JAK1(Homo sapiens (Human))
Portola Pharmaceuticals
US Patent
LigandPNGBDBM362323(US9834548, Example 112)
Affinity DataIC50:  550nM
Ligand InfoPC cidPC sid
In DepthDetails US Patent
TargetTyrosine-protein kinase JAK3(Homo sapiens (Human))
Portola Pharmaceuticals
US Patent
LigandPNGBDBM362323(US9834548, Example 112)
Affinity DataIC50:  5.5nM
Ligand InfoPC cidPC sid
In DepthDetails US Patent
TargetTyrosine-protein kinase JAK2(Homo sapiens (Human))
Portola Pharmaceuticals
US Patent
LigandPNGBDBM362323(US9834548, Example 112)
Affinity DataIC50:  55nM
Ligand InfoPC cidPC sid
In DepthDetails US Patent