BDBM362340 US9834548, Example 129
SMILES CCC(=O)N1CCC(Cn2cc(Nc3cc(NCc4cccc(F)c4F)c(nn3)C(N)=O)cn2)CC1
InChI Key InChIKey=GGLPGPKHZQEBLN-UHFFFAOYSA-N
Data  3 IC50
  Tab Delimited (TSV)   2D SDfile   Computed 3D by Vconf -m prep SDfile
Find this compound or compounds like it in BindingDB:
Activity Spreadsheet -- Enzyme Inhibition Constant Data from BindingDB
Found 3 hits for monomerid = 362340
TargetTyrosine-protein kinase JAK1(Homo sapiens (Human))
Portola Pharmaceuticals
US Patent
LigandPNGBDBM362340(US9834548, Example 129)
Affinity DataIC50:  550nM
Ligand InfoPC cidPC sid
In DepthDetails US Patent
TargetTyrosine-protein kinase JAK3(Homo sapiens (Human))
Portola Pharmaceuticals
US Patent
LigandPNGBDBM362340(US9834548, Example 129)
Affinity DataIC50:  5.5nM
Ligand InfoPC cidPC sid
In DepthDetails US Patent
TargetTyrosine-protein kinase JAK2(Homo sapiens (Human))
Portola Pharmaceuticals
US Patent
LigandPNGBDBM362340(US9834548, Example 129)
Affinity DataIC50:  550nM
Ligand InfoPC cidPC sid
In DepthDetails US Patent