BDBM36531 D158963
SMILES Nc1nc(N)c2c(OCC3CCN(CC(F)(F)F)CC3)cccc2n1
InChI Key InChIKey=OKOIUZSRDPYZNT-UHFFFAOYSA-N
Data  1 IC50  1 EC50
  Tab Delimited (TSV)   2D SDfile   Computed 3D by Vconf -m prep SDfile
Find this compound or compounds like it in BindingDB:
Activity Spreadsheet -- Enzyme Inhibition Constant Data from BindingDB
Found 1 hit for monomerid = 36531
Targetm7GpppX diphosphatase(Homo sapiens (Human))
Decode Chemistry
LigandPNGBDBM36531(D158963)
Affinity DataIC50:  23.4nM EC50:  223nM. Assay description: In vitro biochemical assay using scavenger decapping enzyme (DcpS) as a target and cell based assay using SMN2 b-lactamase NSC-34 cell reporter gene.
In DepthDetails ArticlePubMed