BDBM36546 N-[1-(7-aminoheptyl)-4,5-dihydroxy-6-(hydroxymethyl)piperidin-3-yl]acetamide, 2
SMILES CC(=O)NC1CN(CCCCCCCN)C(CO)C(O)C1O
InChI Key InChIKey=QWZPVJYIJZQINK-UHFFFAOYSA-N
Data  2 KI
  Tab Delimited (TSV)   2D SDfile   Computed 3D by Vconf -m prep SDfile
Find this compound or compounds like it in BindingDB:
Activity Spreadsheet -- Enzyme Inhibition Constant Data from BindingDB
Found 2 hits for monomerid = 36546
TargetBeta-hexosaminidase subunit beta(Homo sapiens (Human))
Academia Sinica
LigandPNGBDBM36546(N-[1-(7-aminoheptyl)-4,5-dihydroxy-6-(hydroxymethy...)
Affinity DataKi:  2.10nM ΔG°:  -12.0kcal/molepH: 4.25 T: 2°C. Assay description: Enzyme inhibition activity assay using 4-methylumbelliferyl N-acetylglucosamine (MUG) as substrate.
In DepthDetails ArticlePubMed
TargetProtein O-GlcNAcase(Homo sapiens (Human))
Academia Sinica
LigandPNGBDBM36546(N-[1-(7-aminoheptyl)-4,5-dihydroxy-6-(hydroxymethy...)
Affinity DataKi:  1.08E+5nM ΔG°:  -5.50kcal/molepH: 4.25 T: 2°C. Assay description: Enzyme inhibition activity assay using 4-methylumbelliferyl N-acetylglucosamine (MUG) as substrate.
In DepthDetails ArticlePubMed