BDBM36560 (R)-EHD
SMILES O[C@H](CN(CCc1ccc2OCOc2c1)C(=O)CCN1C(=O)c2ccccc2C1=O)[C@@H](NC(=O)COc1cc(Cl)c(Cl)cc1Cl)c1ccccc1
InChI Key InChIKey=PPHKHXHEJNPBDJ-UYHPJTEGSA-N
Data  1 KI
  Tab Delimited (TSV)   2D SDfile   Computed 3D by Vconf -m prep SDfile
Find this compound or compounds like it in BindingDB:
Activity Spreadsheet -- Enzyme Inhibition Constant Data from BindingDB
Found 1 hit for monomerid = 36560
TargetCathepsin D(Homo sapiens (Human))
University of California Berkeley
LigandPNGBDBM36560((R)-EHD)
Affinity DataKi: >5.00E+3nMpH: 3.7Assay Description:A fluorometric high through-put assay for inhibitor towards human liver cathepsin D from Calbiochem.
In DepthDetails ArticlePubMed