BDBM36817 ((4-Fluoro-phenyl)-{2-[5-(3-methoxy-phenyl)-[1,3,4]oxadiazol-2-ylsulfanyl]-acetyl}-amino)-acetic acid ethyl ester::2-(4-fluoro-N-[2-[[5-(3-methoxyphenyl)-1,3,4-oxadiazol-2-yl]thio]-1-oxoethyl]anilino)acetic acid ethyl ester::2-(4-fluoro-N-[2-[[5-(3-methoxyphenyl)-1,3,4-oxadiazol-2-yl]thio]acetyl]anilino)acetic acid ethyl ester::MLS000029497::SMR000002373::cid_644711::ethyl 2-(4-fluoro-N-[2-[[5-(3-methoxyphenyl)-1,3,4-oxadiazol-2-yl]sulfanyl]acetyl]anilino)acetate::ethyl 2-[(4-fluorophenyl)-[2-[[5-(3-methoxyphenyl)-1,3,4-oxadiazol-2-yl]sulfanyl]ethanoyl]amino]ethanoate
SMILES CCOC(=O)CN(C(=O)CSc1nnc(o1)-c1cccc(OC)c1)c1ccc(F)cc1
InChI Key InChIKey=ZWUDKHJUAKYIJY-UHFFFAOYSA-N
Data  3 EC50
  Tab Delimited (TSV)   2D SDfile   Computed 3D by Vconf -m prep SDfile
Find this compound or compounds like it in BindingDB:
Activity Spreadsheet -- Enzyme Inhibition Constant Data from BindingDB
Found 1 hit for monomerid = 36817
TargetSphingosine 1-phosphate receptor 1(Homo sapiens (Human))
The Scripps Research Institute Molecular Screening Center
Curated by PubChem BioAssay
LigandPNGBDBM36817(((4-Fluoro-phenyl)-{2-[5-(3-methoxy-phenyl)-[1,3,4...)
Affinity DataEC50:  3.17E+3nM. Assay description: Source (MLSCN Center Name): The Scripps Research Institute Molecular Screening Center Center Affiliation: The Scripps Research Institute, TSRI Assay ...
In DepthDetails PCBioAssay