BDBM36849 4-(1-azepanyl)aniline;hydrochloride::4-(azepan-1-yl)aniline;hydrochloride::4-Azepan-1-yl-phenylamine::MLS000068952::SMR000010837::[4-(azepan-1-yl)phenyl]amine;hydrochloride::cid_6603137
SMILES Nc1ccc(cc1)N1CCCCCC1
InChI Key InChIKey=RDUONPQXZRHVKQ-UHFFFAOYSA-N
Data  3 IC50  3 EC50
  Tab Delimited (TSV)   2D SDfile   Computed 3D by Vconf -m prep SDfile
Find this compound or compounds like it in BindingDB:
Activity Spreadsheet -- Enzyme Inhibition Constant Data from BindingDB
Found 6 hits for monomerid = 36849
TargetSphingosine 1-phosphate receptor 1(Homo sapiens (Human))
The Scripps Research Institute Molecular Screening Center
Curated by PubChem BioAssay
LigandPNGBDBM36849(4-(1-azepanyl)aniline;hydrochloride | 4-(azepan-1-...)
Affinity DataEC50:  9.89E+3nM. Assay description: Source (MLSCN Center Name): The Scripps Research Institute Molecular Screening Center Center Affiliation: The Scripps Research Institute, TSRI Assay ...
In DepthDetails PCBioAssay
TargetSphingosine 1-phosphate receptor 1(Homo sapiens (Human))
The Scripps Research Institute Molecular Screening Center
Curated by PubChem BioAssay
LigandPNGBDBM36849(4-(1-azepanyl)aniline;hydrochloride | 4-(azepan-1-...)
Affinity DataEC50: >1.00E+4nM. Assay description: Source (MLSCN Center Name): The Scripps Research Institute Molecular Screening Center Center Affiliation: The Scripps Research Institute, TSRI Assay ...
In DepthDetails PCBioAssay
TargetDNA damage-inducible transcript 3 protein(Mus musculus)
Emory University
Curated by PubChem BioAssay
LigandPNGBDBM36849(4-(1-azepanyl)aniline;hydrochloride | 4-(azepan-1-...)
Affinity DataIC50:  6.71E+3nM. Assay description: NIH Molecular Libraries Screening Centers Network [MLSCN] Emory Chemical Biology Discovery Center in MLSCN Assay provider: Dr. Randal Kaufman, Univer...
In DepthDetails PCBioAssay
TargetDNA damage-inducible transcript 3 protein(Mus musculus)
Emory University
Curated by PubChem BioAssay
LigandPNGBDBM36849(4-(1-azepanyl)aniline;hydrochloride | 4-(azepan-1-...)
Affinity DataIC50:  6.71E+3nM. Assay description: NIH Molecular Libraries Screening Centers Network [MLSCN] Emory Chemical Biology Discovery Center in MLSCN Assay provider: Dr. Randal Kaufman, Univer...
In DepthDetails PCBioAssay
TargetX-box-binding protein 1(Homo sapiens (Human))
Emory University
Curated by PubChem BioAssay
LigandPNGBDBM36849(4-(1-azepanyl)aniline;hydrochloride | 4-(azepan-1-...)
Affinity DataIC50:  1.00E+4nM. Assay description: NIH Molecular Libraries Screening Centers Network [MLSCN] Emory Chemical Biology Discovery Center in MLSCN Assay provider: Dr. Randal Kaufman, Univer...
In DepthDetails PCBioAssay
TargetSphingosine 1-phosphate receptor 1(Homo sapiens (Human))
The Scripps Research Institute Molecular Screening Center
Curated by PubChem BioAssay
LigandPNGBDBM36849(4-(1-azepanyl)aniline;hydrochloride | 4-(azepan-1-...)
Affinity DataEC50: >3.00E+4nM. Assay description: Source (MLSCN Center Name): The Scripps Research Institute Molecular Screening Center Center Affiliation: The Scripps Research Institute, TSRI Assay ...
In DepthDetails PCBioAssay