BDBM372468 N-[2-(3,4-Difluoro-benzyl)-2H-[1,2,3]triazol-4-yl]-2-[4-(3-methyl-oxetan-3-yl)-phenyl]-acetamide::US10246426, Example 22
SMILES CC1(COC1)c1ccc(CC(=O)Nc2cnn(Cc3ccc(F)c(F)c3)n2)cc1
InChI Key InChIKey=AWCWWPRKVDHVMJ-UHFFFAOYSA-N
Data  1 IC50
  Tab Delimited (TSV)   2D SDfile   Computed 3D by Vconf -m prep SDfile
Find this compound or compounds like it in BindingDB:
Activity Spreadsheet -- Enzyme Inhibition Constant Data from BindingDB
Found 1 hit for monomerid = 372468
TargetVoltage-dependent T-type calcium channel subunit alpha-1H(Homo sapiens (Human))
Idorsia Pharmaceuticals
US Patent
LigandPNGBDBM372468(N-[2-(3,4-Difluoro-benzyl)-2H-[1,2,3]triazol-4-yl]...)
Affinity DataIC50:  15nM. Assay description: Stock solutions of test compounds are prepared to a concentration of 10 mM in DMSO. For the Cav3.2 assay, serial dilutions of the compounds are prepa...
Ligand InfoPC cidPC sid
In DepthDetails US Patent