BDBM372509 2-[6-(3,3-Difluoro-pyrrolidin-1-yl)-pyridin-3-yl]-N-[2-(4-methyl-benzyl)-2H-[1,2,3]triazol-4-yl]-acetamide::US10246426, Example 65
SMILES Cc1ccc(Cn2ncc(NC(=O)Cc3ccc(nc3)N3CCC(F)(F)C3)n2)cc1
InChI Key InChIKey=QOEAAMOANRDCTG-UHFFFAOYSA-N
Data  1 IC50
  Tab Delimited (TSV)   2D SDfile   Computed 3D by Vconf -m prep SDfile
Find this compound or compounds like it in BindingDB:
Activity Spreadsheet -- Enzyme Inhibition Constant Data from BindingDB
Found 1 hit for monomerid = 372509
TargetVoltage-dependent T-type calcium channel subunit alpha-1H(Homo sapiens (Human))
Idorsia Pharmaceuticals
US Patent
LigandPNGBDBM372509(2-[6-(3,3-Difluoro-pyrrolidin-1-yl)-pyridin-3-yl]-...)
Affinity DataIC50:  23nM. Assay description: Stock solutions of test compounds are prepared to a concentration of 10 mM in DMSO. For the Cav3.2 assay, serial dilutions of the compounds are prepa...
Ligand InfoPC cidPC sid
In DepthDetails US Patent