BDBM372547 N-[2-(4-Cyano-3-fluoro-benzyl)-2H-[1,2,3]triazol-4-yl]-2-(1,3-dimethyl-1H-indol-6-yl)-acetamide::US10246426, Example 105
SMILES Cc1cn(C)c2cc(CC(=O)Nc3cnn(Cc4ccc(C#N)c(F)c4)n3)ccc12
InChI Key InChIKey=YDIHOQFVHSIJDV-UHFFFAOYSA-N
Data  1 IC50
  Tab Delimited (TSV)   2D SDfile   Computed 3D by Vconf -m prep SDfile
Find this compound or compounds like it in BindingDB:
Activity Spreadsheet -- Enzyme Inhibition Constant Data from BindingDB
Found 1 hit for monomerid = 372547
TargetVoltage-dependent T-type calcium channel subunit alpha-1H(Homo sapiens (Human))
Idorsia Pharmaceuticals
US Patent
LigandPNGBDBM372547(N-[2-(4-Cyano-3-fluoro-benzyl)-2H-[1,2,3]triazol-4...)
Affinity DataIC50:  20nM. Assay description: Stock solutions of test compounds are prepared to a concentration of 10 mM in DMSO. For the Cav3.2 assay, serial dilutions of the compounds are prepa...
Ligand InfoPC cidPC sid
In DepthDetails US Patent