BDBM372628 N-[2-(3-Fluoro-4-trifluoromethoxy-benzyl)-2H-[1,2,3]triazol-4-yl]-2-(1-methyl-1H-indazol-6-yl)-acetamide::US10246426, Example 185
SMILES Cn1ncc2ccc(CC(=O)Nc3cnn(Cc4ccc(OC(F)(F)F)c(F)c4)n3)cc12
InChI Key InChIKey=BTPWUVMDCXCOGQ-UHFFFAOYSA-N
Data  1 IC50
  Tab Delimited (TSV)   2D SDfile   Computed 3D by Vconf -m prep SDfile
Find this compound or compounds like it in BindingDB:
Activity Spreadsheet -- Enzyme Inhibition Constant Data from BindingDB
Found 1 hit for monomerid = 372628
TargetVoltage-dependent T-type calcium channel subunit alpha-1H(Homo sapiens (Human))
Idorsia Pharmaceuticals
US Patent
LigandPNGBDBM372628(N-[2-(3-Fluoro-4-trifluoromethoxy-benzyl)-2H-[1,2,...)
Affinity DataIC50:  17nM. Assay description: Stock solutions of test compounds are prepared to a concentration of 10 mM in DMSO. For the Cav3.2 assay, serial dilutions of the compounds are prepa...
Ligand InfoPC cidPC sid
In DepthDetails US Patent