BDBM372636 2-(1-Ethyl-1H-indazol-5-yl)-N-[2-(3-fluoro-4-trifluoromethoxy-benzyl)-2H-[1,2,3]triazol-4-yl]-acetamide::US10246426, Example 190
SMILES CCn1ncc2cc(CC(=O)Nc3cnn(Cc4ccc(OC(F)(F)F)c(F)c4)n3)ccc12
InChI Key InChIKey=JRUVMMFLSLQYGP-UHFFFAOYSA-N
Data  1 IC50
  Tab Delimited (TSV)   2D SDfile   Computed 3D by Vconf -m prep SDfile
Find this compound or compounds like it in BindingDB:
Activity Spreadsheet -- Enzyme Inhibition Constant Data from BindingDB
Found 1 hit for monomerid = 372636
TargetVoltage-dependent T-type calcium channel subunit alpha-1H(Homo sapiens (Human))
Idorsia Pharmaceuticals
US Patent
LigandPNGBDBM372636(2-(1-Ethyl-1H-indazol-5-yl)-N-[2-(3-fluoro-4-trifl...)
Affinity DataIC50:  14nM. Assay description: Stock solutions of test compounds are prepared to a concentration of 10 mM in DMSO. For the Cav3.2 assay, serial dilutions of the compounds are prepa...
Ligand InfoPC cidPC sid
In DepthDetails US Patent