BDBM37622 4-(2-Chloro-benzyl)-2-methyl-4H-benzo[1,4]oxazin-3-one::4-(2-chlorobenzyl)-2-methyl-1,4-benzoxazin-3-one::4-[(2-chlorophenyl)methyl]-2-methyl-1,4-benzoxazin-3-one::MLS000074265::SMR000007781::cid_653539
SMILES CC1Oc2ccccc2N(Cc2ccccc2Cl)C1=O
InChI Key InChIKey=XESORBQACFGSND-UHFFFAOYSA-N
Data  2 KI  2 IC50
  Tab Delimited (TSV)   2D SDfile   Computed 3D by Vconf -m prep SDfile
Find this compound or compounds like it in BindingDB:
Activity Spreadsheet -- Enzyme Inhibition Constant Data from BindingDB
Found 4 hits for monomerid = 37622
TargetN-formyl peptide receptor 2(Homo sapiens (Human))
Nmmlsc
Curated by PubChem BioAssay
LigandPNGBDBM37622(4-(2-Chloro-benzyl)-2-methyl-4H-benzo[1,4]oxazin-3...)
Affinity DataKi: >4.03E+4nM. Assay description: University of New Mexico Assay Overview Assay Support: NIH 1R03MH076381-01 Assay for Formylpeptide Receptor Family Ligands PI: Bruce S. Edwards, Ph....
In DepthDetails PCBioAssay
TargetfMet-Leu-Phe receptor(Homo sapiens (Human))
Nmmlsc
Curated by PubChem BioAssay
LigandPNGBDBM37622(4-(2-Chloro-benzyl)-2-methyl-4H-benzo[1,4]oxazin-3...)
Affinity DataKi: >4.37E+4nM. Assay description: University of New Mexico Assay Overview: Assay Support: NIH 1R03MH076381-01 Assay for Formylpeptide Receptor Family Ligands PI: Bruce S. Edwards, Ph...
In DepthDetails PCBioAssay
TargetN-formyl peptide receptor 2(Homo sapiens (Human))
Nmmlsc
Curated by PubChem BioAssay
LigandPNGBDBM37622(4-(2-Chloro-benzyl)-2-methyl-4H-benzo[1,4]oxazin-3...)
Affinity DataIC50: >6.67E+4nM. Assay description: University of New Mexico Assay Overview Assay Support: NIH 1R03MH076381-01 Assay for Formylpeptide Receptor Family Ligands PI: Bruce S. Edwards, Ph....
In DepthDetails PCBioAssay
TargetfMet-Leu-Phe receptor(Homo sapiens (Human))
Nmmlsc
Curated by PubChem BioAssay
LigandPNGBDBM37622(4-(2-Chloro-benzyl)-2-methyl-4H-benzo[1,4]oxazin-3...)
Affinity DataIC50: >6.67E+4nM. Assay description: University of New Mexico Assay Overview: Assay Support: NIH 1R03MH076381-01 Assay for Formylpeptide Receptor Family Ligands PI: Bruce S. Edwards, Ph...
In DepthDetails PCBioAssay