BDBM37630 1-[2-(3,4-Dimethoxy-phenyl)-ethyl]-4-(furan-2-carbonyl)-3-hydroxy-5-thiophen-2-yl-1,5-dihydro-pyrrol-2-one::1-[2-(3,4-dimethoxyphenyl)ethyl]-3-(furan-2-carbonyl)-4-hydroxy-2-thiophen-2-yl-2H-pyrrol-5-one::1-[2-(3,4-dimethoxyphenyl)ethyl]-3-(furan-2-ylcarbonyl)-4-oxidanyl-2-thiophen-2-yl-2H-pyrrol-5-one::1-[2-(3,4-dimethoxyphenyl)ethyl]-3-[2-furanyl(oxo)methyl]-4-hydroxy-2-thiophen-2-yl-2H-pyrrol-5-one::4-(2-furoyl)-1-homoveratryl-3-hydroxy-5-(2-thienyl)-3-pyrrolin-2-one::MLS000069060::SMR000013782::cid_656027
SMILES COc1ccc(CCN2C(C(C(=O)c3ccco3)C(=O)C2=O)c2cccs2)cc1OC
InChI Key InChIKey=PXRKOYNZASCFHI-UHFFFAOYSA-N
Data  2 KI  2 IC50
  Tab Delimited (TSV)   2D SDfile   Computed 3D by Vconf -m prep SDfile
Find this compound or compounds like it in BindingDB:
Activity Spreadsheet -- Enzyme Inhibition Constant Data from BindingDB
Found 4 hits for monomerid = 37630
TargetfMet-Leu-Phe receptor(Homo sapiens (Human))
Nmmlsc
Curated by PubChem BioAssay
LigandPNGBDBM37630(1-[2-(3,4-Dimethoxy-phenyl)-ethyl]-4-(furan-2-carb...)
Affinity DataKi:  1.24E+4nM. Assay description: University of New Mexico Assay Overview: Assay Support: NIH 1R03MH076381-01 Assay for Formylpeptide Receptor Family Ligands PI: Bruce S. Edwards, Ph...
In DepthDetails PCBioAssay
TargetN-formyl peptide receptor 2(Homo sapiens (Human))
Nmmlsc
Curated by PubChem BioAssay
LigandPNGBDBM37630(1-[2-(3,4-Dimethoxy-phenyl)-ethyl]-4-(furan-2-carb...)
Affinity DataKi: >4.03E+4nM. Assay description: University of New Mexico Assay Overview Assay Support: NIH 1R03MH076381-01 Assay for Formylpeptide Receptor Family Ligands PI: Bruce S. Edwards, Ph....
In DepthDetails PCBioAssay
TargetN-formyl peptide receptor 2(Homo sapiens (Human))
Nmmlsc
Curated by PubChem BioAssay
LigandPNGBDBM37630(1-[2-(3,4-Dimethoxy-phenyl)-ethyl]-4-(furan-2-carb...)
Affinity DataIC50: >6.67E+4nM. Assay description: University of New Mexico Assay Overview Assay Support: NIH 1R03MH076381-01 Assay for Formylpeptide Receptor Family Ligands PI: Bruce S. Edwards, Ph....
In DepthDetails PCBioAssay
TargetfMet-Leu-Phe receptor(Homo sapiens (Human))
Nmmlsc
Curated by PubChem BioAssay
LigandPNGBDBM37630(1-[2-(3,4-Dimethoxy-phenyl)-ethyl]-4-(furan-2-carb...)
Affinity DataIC50:  1.90E+4nM. Assay description: University of New Mexico Assay Overview: Assay Support: NIH 1R03MH076381-01 Assay for Formylpeptide Receptor Family Ligands PI: Bruce S. Edwards, Ph...
In DepthDetails PCBioAssay