BDBM37932 6-(1-azepanyl)-7H-purine::6-(azepan-1-yl)-7H-purine::MLS000101234::SMR000015975::cid_756689
SMILES C1CCCN(CC1)c1ncnc2nc[nH]c12
InChI Key InChIKey=LPDNHQZTRVRLOW-UHFFFAOYSA-N
Data  2 IC50
  Tab Delimited (TSV)   2D SDfile   Computed 3D by Vconf -m prep SDfile
Find this compound or compounds like it in BindingDB:
Activity Spreadsheet -- Enzyme Inhibition Constant Data from BindingDB
Found 2 hits for monomerid = 37932
TargetRho-associated protein kinase 2(Homo sapiens (Human))
The Scripps Research Institute Molecular Screening Center
Curated by PubChem BioAssay
LigandPNGBDBM37932(6-(1-azepanyl)-7H-purine | 6-(azepan-1-yl)-7H-puri...)
Affinity DataIC50:  1.49E+3nM. Assay description: Source (MLSCN Center Name): The Scripps Research Institute Molecular Screening Center Center Affiliation: The Scripps Research Institute, TSRI Assay ...
In DepthDetails PCBioAssay
TargetcAMP-dependent protein kinase catalytic subunit alpha(Homo sapiens (Human))
The Scripps Research Institute Molecular Screening Center
Curated by PubChem BioAssay
LigandPNGBDBM37932(6-(1-azepanyl)-7H-purine | 6-(azepan-1-yl)-7H-puri...)
Affinity DataIC50:  1.48E+4nM. Assay description: Source (MLSCN Center Name): The Scripps Research Institute Molecular Screening Center Center Affiliation: The Scripps Research Institute, TSRI Assay ...
In DepthDetails PCBioAssay