BDBM37934 1-(7H-purin-6-yl)-4-piperidinecarboxylic acid ethyl ester::1-(7H-purin-6-yl)isonipecotic acid ethyl ester::MLS000101237::SMR000017640::cid_2155061::ethyl 1-(7H-purin-6-yl)piperidine-4-carboxylate
SMILES CCOC(=O)C1CCN(CC1)c1ncnc2nc[nH]c12
InChI Key InChIKey=XFEZZQUTXFCCRQ-UHFFFAOYSA-N
Data  2 IC50
  Tab Delimited (TSV)   2D SDfile   Computed 3D by Vconf -m prep SDfile
Find this compound or compounds like it in BindingDB:
Activity Spreadsheet -- Enzyme Inhibition Constant Data from BindingDB
Found 2 hits for monomerid = 37934
TargetRho-associated protein kinase 2(Homo sapiens (Human))
The Scripps Research Institute Molecular Screening Center
Curated by PubChem BioAssay
LigandPNGBDBM37934(1-(7H-purin-6-yl)-4-piperidinecarboxylic acid ethy...)
Affinity DataIC50:  2.20E+3nM. Assay description: Source (MLSCN Center Name): The Scripps Research Institute Molecular Screening Center Center Affiliation: The Scripps Research Institute, TSRI Assay ...
In DepthDetails PCBioAssay
TargetcAMP-dependent protein kinase catalytic subunit alpha(Homo sapiens (Human))
The Scripps Research Institute Molecular Screening Center
Curated by PubChem BioAssay
LigandPNGBDBM37934(1-(7H-purin-6-yl)-4-piperidinecarboxylic acid ethy...)
Affinity DataIC50:  1.15E+4nM. Assay description: Source (MLSCN Center Name): The Scripps Research Institute Molecular Screening Center Center Affiliation: The Scripps Research Institute, TSRI Assay ...
In DepthDetails PCBioAssay