BDBM37943 MLS000104363::N-[(Z)-3-indolylidenemethyl]hydroxylamine::N-[(Z)-indol-3-ylidenemethyl]hydroxylamine::SMR000054298::cid_5310834
SMILES O=NCc1c[nH]c2ccccc12
InChI Key InChIKey=RHSVEPLCFZUEGW-UHFFFAOYSA-N
Data  3 IC50
  Tab Delimited (TSV)   2D SDfile   Computed 3D by Vconf -m prep SDfile
Find this compound or compounds like it in BindingDB:
Activity Spreadsheet -- Enzyme Inhibition Constant Data from BindingDB
Found 3 hits for monomerid = 37943
TargetcAMP-dependent protein kinase catalytic subunit alpha(Homo sapiens (Human))
The Scripps Research Institute Molecular Screening Center
Curated by PubChem BioAssay
LigandPNGBDBM37943(MLS000104363 | N-[(Z)-3-indolylidenemethyl]hydroxy...)
Affinity DataIC50:  3.44E+4nM. Assay description: Source (MLSCN Center Name): The Scripps Research Institute Molecular Screening Center Center Affiliation: The Scripps Research Institute, TSRI Assay ...
In DepthDetails PCBioAssay
TargetM17 leucyl aminopeptidase(Plasmodium falciparum 3D7)
Srmlsc
Curated by PubChem BioAssay
LigandPNGBDBM37943(MLS000104363 | N-[(Z)-3-indolylidenemethyl]hydroxy...)
Affinity DataIC50:  1.32E+4nM. Assay description: Southern Research Molecular Libraries Screening Center (SRMLSC) Southern Research Institute (Birmingham, Alabama) NIH Molecular Libraries Screening...
In DepthDetails PCBioAssay
TargetRho-associated protein kinase 2(Homo sapiens (Human))
The Scripps Research Institute Molecular Screening Center
Curated by PubChem BioAssay
LigandPNGBDBM37943(MLS000104363 | N-[(Z)-3-indolylidenemethyl]hydroxy...)
Affinity DataIC50:  4.81E+3nM. Assay description: Source (MLSCN Center Name): The Scripps Research Institute Molecular Screening Center Center Affiliation: The Scripps Research Institute, TSRI Assay ...
In DepthDetails PCBioAssay