BDBM39189 MLS000073783::N-[3-[2-[(4-methyl-5-pyridin-4-yl-1,2,4-triazol-3-yl)sulfanyl]ethanoylamino]phenyl]thiophene-2-carboxamide::N-[3-[[2-[(4-methyl-5-pyridin-4-yl-1,2,4-triazol-3-yl)sulfanyl]acetyl]amino]phenyl]thiophene-2-carboxamide::N-[3-[[2-[(4-methyl-5-pyridin-4-yl-1,2,4-triazol-3-yl)thio]-1-oxoethyl]amino]phenyl]-2-thiophenecarboxamide::N-[3-[[2-[[4-methyl-5-(4-pyridyl)-1,2,4-triazol-3-yl]thio]acetyl]amino]phenyl]thiophene-2-carboxamide::SMR000004641::Thiophene-2-carboxylic acid {3-[2-(4-methyl-5-pyridin-4-yl-4H-[1,2,4]triazol-3-ylsulfanyl)-acetylamino]-phenyl}-amide::cid_646821
SMILES Cn1c(SCC(=O)Nc2cccc(NC(=O)c3cccs3)c2)nnc1-c1ccncc1
InChI Key InChIKey=QRFOWSJPPPKAEB-UHFFFAOYSA-N
Data  1 IC50
  Tab Delimited (TSV)   2D SDfile   Computed 3D by Vconf -m prep SDfile
Find this compound or compounds like it in BindingDB:
Activity Spreadsheet -- Enzyme Inhibition Constant Data from BindingDB
Found 1 hit for monomerid = 39189
TargetRho-associated protein kinase 2(Homo sapiens (Human))
The Scripps Research Institute Molecular Screening Center
Curated by PubChem BioAssay
LigandPNGBDBM39189(MLS000073783 | N-[3-[2-[(4-methyl-5-pyridin-4-yl-1...)
Affinity DataIC50:  661nM. Assay description: Source (MLSCN Center Name): The Scripps Research Institute Molecular Screening Center Center Affiliation: The Scripps Research Institute, TSRI Assay ...
In DepthDetails PCBioAssay