BDBM39231 2-(1H-indazol-6-ylsulfamoyl)benzoic acid methyl ester::MLS000053313::SMR000067652::cid_2091316::methyl 2-(1H-indazol-6-ylsulfamoyl)benzoate
SMILES COC(=O)c1ccccc1S(=O)(=O)Nc1ccc2cn[nH]c2c1
InChI Key InChIKey=HJCKUXQIHNKIRX-UHFFFAOYSA-N
Data  1 IC50
  Tab Delimited (TSV)   2D SDfile   Computed 3D by Vconf -m prep SDfile
Find this compound or compounds like it in BindingDB:
Activity Spreadsheet -- Enzyme Inhibition Constant Data from BindingDB
Found 1 hit for monomerid = 39231
TargetRho-associated protein kinase 2(Homo sapiens (Human))
The Scripps Research Institute Molecular Screening Center
Curated by PubChem BioAssay
LigandPNGBDBM39231(2-(1H-indazol-6-ylsulfamoyl)benzoic acid methyl es...)
Affinity DataIC50:  1.52E+3nM. Assay description: Source (MLSCN Center Name): The Scripps Research Institute Molecular Screening Center Center Affiliation: The Scripps Research Institute, TSRI Assay ...
In DepthDetails PCBioAssay