BDBM39241 MLS000090506::N-[2-methyl-1-(4-pyridylcarbamoyl)propyl]cyclohexanecarboxamide::N-[3-methyl-1-oxidanylidene-1-(pyridin-4-ylamino)butan-2-yl]cyclohexanecarboxamide::N-[3-methyl-1-oxo-1-(pyridin-4-ylamino)butan-2-yl]cyclohexanecarboxamide::N-{2-methyl-1-[(pyridin-4-ylamino)carbonyl]propyl}cyclohexanecarboxamide::SMR000025110::cid_3240382
SMILES CC(C)C(NC(=O)C1CCCCC1)C(=O)Nc1ccncc1
InChI Key InChIKey=VYLDPSVXLWTIAJ-UHFFFAOYSA-N
Data  1 IC50
PDB links: 1 PDB ID matches this monomer.
  Tab Delimited (TSV)   2D SDfile   Computed 3D by Vconf -m prep SDfile
Find this compound or compounds like it in BindingDB:
Activity Spreadsheet -- Enzyme Inhibition Constant Data from BindingDB
Found 1 hit for monomerid = 39241
TargetRho-associated protein kinase 2(Homo sapiens (Human))
The Scripps Research Institute Molecular Screening Center
Curated by PubChem BioAssay
LigandPNGBDBM39241(MLS000090506 | N-[2-methyl-1-(4-pyridylcarbamoyl)p...)
Affinity DataIC50:  2.30E+3nM. Assay description: Source (MLSCN Center Name): The Scripps Research Institute Molecular Screening Center Center Affiliation: The Scripps Research Institute, TSRI Assay ...
In DepthDetails PCBioAssay