BDBM39270 2-(2-keto-4-methyl-chromen-7-yl)oxy-N-thiazol-2-yl-propionamide::2-(4-methyl-2-oxidanylidene-chromen-7-yl)oxy-N-(1,3-thiazol-2-yl)propanamide::2-(4-methyl-2-oxochromen-7-yl)oxy-N-(1,3-thiazol-2-yl)propanamide::2-[(4-methyl-2-oxo-1-benzopyran-7-yl)oxy]-N-(2-thiazolyl)propanamide::2-[(4-methyl-2-oxo-2H-chromen-7-yl)oxy]-N-1,3-thiazol-2-ylpropanamide::MLS000065518::SMR000080099::cid_2969827
SMILES CC(Oc1ccc2c(C)cc(=O)oc2c1)C(=O)Nc1nccs1
InChI Key InChIKey=YZIMHCVKTQWEEE-UHFFFAOYSA-N
Data  1 IC50
  Tab Delimited (TSV)   2D SDfile   Computed 3D by Vconf -m prep SDfile
Find this compound or compounds like it in BindingDB:
Activity Spreadsheet -- Enzyme Inhibition Constant Data from BindingDB
Found 1 hit for monomerid = 39270
TargetRho-associated protein kinase 2(Homo sapiens (Human))
The Scripps Research Institute Molecular Screening Center
Curated by PubChem BioAssay
LigandPNGBDBM39270(2-(2-keto-4-methyl-chromen-7-yl)oxy-N-thiazol-2-yl...)
Affinity DataIC50:  1.99E+3nM. Assay description: Source (MLSCN Center Name): The Scripps Research Institute Molecular Screening Center Center Affiliation: The Scripps Research Institute, TSRI Assay ...
In DepthDetails PCBioAssay