BDBM39277 5-[(2-methoxyphenoxy)methyl]-N-(4-pyridyl)-2-furamide::5-[(2-methoxyphenoxy)methyl]-N-4-pyridinyl-2-furamide::5-[(2-methoxyphenoxy)methyl]-N-pyridin-4-yl-2-furancarboxamide::5-[(2-methoxyphenoxy)methyl]-N-pyridin-4-yl-furan-2-carboxamide::5-[(2-methoxyphenoxy)methyl]-N-pyridin-4-ylfuran-2-carboxamide::MLS000089159::SMR000072864::cid_717087
SMILES COc1ccccc1OCc1ccc(o1)C(=O)Nc1ccncc1
InChI Key InChIKey=DJALHOOGNUAXQF-UHFFFAOYSA-N
Data  1 IC50
  Tab Delimited (TSV)   2D SDfile   Computed 3D by Vconf -m prep SDfile
Find this compound or compounds like it in BindingDB:
Activity Spreadsheet -- Enzyme Inhibition Constant Data from BindingDB
Found 1 hit for monomerid = 39277
TargetRho-associated protein kinase 2(Homo sapiens (Human))
The Scripps Research Institute Molecular Screening Center
Curated by PubChem BioAssay
LigandPNGBDBM39277(5-[(2-methoxyphenoxy)methyl]-N-(4-pyridyl)-2-furam...)
Affinity DataIC50:  3.31E+3nM. Assay description: Source (MLSCN Center Name): The Scripps Research Institute Molecular Screening Center Center Affiliation: The Scripps Research Institute, TSRI Assay ...
In DepthDetails PCBioAssay