BDBM39312 MLS000104902::N-(4-pyridyl)thiophene-2-carboxamide::N-pyridin-4-yl-2-thiophenecarboxamide::N-pyridin-4-ylthiophene-2-carboxamide::SMR000054832::cid_676266
SMILES O=C(Nc1ccncc1)c1cccs1
InChI Key InChIKey=RKADCAQUGVEIJY-UHFFFAOYSA-N
Data  1 IC50
  Tab Delimited (TSV)   2D SDfile   Computed 3D by Vconf -m prep SDfile
Find this compound or compounds like it in BindingDB:
Activity Spreadsheet -- Enzyme Inhibition Constant Data from BindingDB
Found 1 hit for monomerid = 39312
TargetRho-associated protein kinase 2(Homo sapiens (Human))
The Scripps Research Institute Molecular Screening Center
Curated by PubChem BioAssay
LigandPNGBDBM39312(MLS000104902 | N-(4-pyridyl)thiophene-2-carboxamid...)
Affinity DataIC50:  1.91E+3nM. Assay description: Source (MLSCN Center Name): The Scripps Research Institute Molecular Screening Center Center Affiliation: The Scripps Research Institute, TSRI Assay ...
In DepthDetails PCBioAssay