BDBM39395 2-[4-amino-5-(3-methoxyphenyl)-3-methylpyrazolo[3,4-d]pyrimidin-6-yl]sulfanyl-N-(3-methoxyphenyl)acetamide::2-[4-azanyl-5-(3-methoxyphenyl)-3-methyl-pyrazolo[3,4-d]pyrimidin-6-yl]sulfanyl-N-(3-methoxyphenyl)ethanamide::2-[[4-amino-5-(3-methoxyphenyl)-3-methyl-6-pyrazolo[3,4-d]pyrimidinyl]thio]-N-(3-methoxyphenyl)acetamide::2-[[4-amino-5-(3-methoxyphenyl)-3-methyl-pyrazolo[3,4-d]pyrimidin-6-yl]thio]-N-(3-methoxyphenyl)acetamide::2-{[4-imino-5-(3-methoxyphenyl)-3-methyl-4,5-dihydro-1H-pyrazolo[3,4-d]pyrimidin-6-yl]thio}-N-(3-methoxyphenyl)acetamide::MLS000047099::SMR000033110::cid_3240708
SMILES COc1cccc(NC(=O)CSc2nc3nnc(C)c3c(N)n2-c2cccc(OC)c2)c1
InChI Key InChIKey=ZYEXPKSISGIQNH-UHFFFAOYSA-N
Data  1 IC50
  Tab Delimited (TSV)   2D SDfile   Computed 3D by Vconf -m prep SDfile
Find this compound or compounds like it in BindingDB:
Activity Spreadsheet -- Enzyme Inhibition Constant Data from BindingDB
Found 1 hit for monomerid = 39395
TargetGenome polyprotein(West Nile virus)
University of Pittsburgh
Curated by PubChem BioAssay
LigandPNGBDBM39395(2-[4-amino-5-(3-methoxyphenyl)-3-methylpyrazolo[3,...)
Affinity DataIC50: >5.00E+4nM. Assay description: The HTS assay to identify Inhibitors of West Nile Virus (WNV) NS2bNS3 Proteinase was proposed by Dr Alex Strongin of the Burnham Institute XO1-MH0776...
In DepthDetails PCBioAssay