BDBM395230 US10308628, Compound 2
SMILES OC(=O)[C@@H]1C[C@@H](CCN1C(=O)C(c1ccccc1)c1ccccc1)N1CCCOc2cc(F)ccc12
InChI Key InChIKey=CSFNKZLNHAGZBY-NOZRDPDXSA-N
Data  1 KI
  Tab Delimited (TSV)   2D SDfile   Computed 3D by Vconf -m prep SDfile
Find this compound or compounds like it in BindingDB:
Activity Spreadsheet -- Enzyme Inhibition Constant Data from BindingDB
Found 1 hit for monomerid = 395230
TargetType-2 angiotensin II receptor(Homo sapiens (Human))
Novartis
US Patent
LigandPNGBDBM395230(US10308628, Compound 2)
Affinity DataKi:  9nM. Assay description: 15 μL of [125I]CGP 42112A, at a final concentration of 0.05 nM was added to wells of assay plate.Membranes were dispersed using a 21 gauge needl...
Ligand InfoPC cidPC sid
In DepthDetails US Patent